program: Gaussian 09
title: 000024838
version: EM64L-G09RevD.01
frameworkgroup: C1[X(C11H22O2)]
method: RPBEPBE
basis: SDD
operation: Freq
keyword: #pfreq=noraman
keyword: PBEPBE/SDD
title: #p freq=noraman PBEPBE/SDD
converged: YES YES NO NO
title: Mulliken charges:
elementType: O O C C C C C C C C C C C H H H H H H H H H H H H H H H H H H H H H H
charge: -0.263825 -0.248573 -0.364088 -0.389699 -0.348746 -0.157882 -0.282234 -0.354805 -0.371729 0.241288 -0.714004 -0.694172 -0.692938 0.190847 0.190767 0.210084 0.210299 0.189815 0.189980 0.231638 0.224434 0.223382 0.195641 0.195700 0.221441 0.202865 0.235176 0.217019 0.221999 0.216759 0.210201 0.210263 0.210364 0.215935 0.226801
chargesum: 0.00000
title: Mulliken charges with hydrogens summed into heavy atoms:
elementType: O O C C C C C C C C C C C
charge: -0.263825 -0.248573 0.017526 0.030684 0.031049 0.073756 0.165582 0.036535 0.052577 0.241288 -0.039810 -0.056950 -0.039839
polarizability: 1.62663942e+02 -1.91081813e+00 1.10913827e+02 -5.55506681e-01 -1.01488321e+00 1.09754466e+02
1716.lowfreq: -4.9730 -0.0009 -0.0008 -0.0008 9.3007 18.1498 19.1100 35.4666 50.5203
frequency: 18.9782 34.9386 50.4309 54.4044 75.3125 83.8549 113.9113 133.3014 135.8252 150.5679 180.0894 207.4560 223.1687 231.4313 235.1453 259.6913 280.5231 312.0267 394.1913 421.7768 436.4262 506.7196 636.3576 714.2287 725.4873 746.0242 783.0995 794.6047 820.6257 856.7300 882.3837 890.0444 924.2661 967.2472 985.3190 1011.2319 1012.6249 1032.0532 1050.0675 1070.5955 1083.3704 1096.1654 1105.0872 1114.1746 1127.5385 1148.7912 1166.1361 1195.4313 1238.2861 1242.7941 1257.2094 1272.8383 1289.1535 1290.4394 1291.5433 1294.4722 1333.1310 1338.3062 1349.2643 1358.6069 1375.5414 1387.7298 1392.2551 1392.9721 1460.7423 1464.8257 1466.7015 1470.8810 1474.1855 1477.4665 1477.6832 1478.5085 1482.2311 1482.8323 1485.4802 1490.7819 1633.8662 2955.4980 2960.1326 2970.0075 2973.2804 2977.7310 2984.2368 2986.5978 2990.0358 2991.9513 3000.5999 3008.4611 3024.5780 3031.0143 3043.9014 3045.3354 3069.6354 3072.3864 3074.3396 3075.6805 3077.6909 3082.4309 3092.7371
redmass: 3.4850 4.9963 3.5740 1.6200 3.2819 2.1122 1.7190 2.8516 2.5165 2.1405 3.4603 1.8580 1.0576 2.5376 1.1411 2.0849 3.3393 3.2514 3.1761 3.2037 3.1882 3.7566 2.7464 5.2521 1.0674 1.0944 1.8454 1.1582 1.8591 3.2836 1.2079 1.8960 3.8453 1.2436 1.1447 3.4123 1.6475 3.0312 3.0693 2.6923 2.1482 2.4606 1.9930 2.7451 2.8034 1.4676 2.1558 1.5240 1.2850 1.2913 1.2602 1.1114 1.0966 1.2531 1.1139 1.2823 1.3934 1.3873 1.5361 1.6348 1.5413 1.2409 1.2177 1.2157 1.0730 1.0755 1.0732 1.0762 1.0515 1.0714 1.0493 1.0421 1.0467 1.0602 1.0794 1.0946 9.1033 1.0590 1.0591 1.0589 1.0367 1.0355 1.0409 1.0539 1.0599 1.0978 1.0566 1.1015 1.0881 1.1037 1.0982 1.1044 1.1009 1.0994 1.1073 1.1009 1.0998 1.1001 1.1002
irintensity: 0.3548 1.2185 0.3091 0.1902 0.1685 0.0744 0.3850 0.6760 0.4973 0.0740 1.1865 3.3902 0.2452 2.0051 0.1224 1.6759 6.4985 6.4715 0.8367 8.2375 0.3069 1.2054 0.2301 3.9845 12.3286 0.0727 11.7083 1.5236 4.6021 6.1013 1.3524 7.9770 19.1636 8.5042 0.0988 6.3266 29.9949 0.3640 17.4264 32.6567 30.1150 7.0688 102.0762 252.1665 1.6151 2.6392 24.0116 0.0222 4.2976 0.2635 13.4619 0.0908 0.1295 3.5100 0.8970 0.8892 7.3270 12.3604 23.2976 1.3570 3.0738 11.8446 11.8959 20.1569 6.0278 0.0058 0.0780 2.8987 16.8015 0.2052 8.9190 12.5622 11.8489 18.9445 1.9278 27.0307 152.1768 0.0135 8.8359 90.3868 34.0825 31.8042 11.3204 50.2674 18.5243 0.4090 41.6877 0.6850 5.0737 31.2371 5.9205 21.9250 57.4597 52.9040 110.9226 46.2300 40.5384 44.1542 37.4355
temp: 298.150 k
press: 1.00000 atm
elementType: 8 8 6 6 6 6 6 6 6 6 6 6 6 1 1 1 1 1 1 1 1 1 1 1 1 1 1 1 1 1 1 1 1 1 1
symmnumber: 1
zpe: 815965.9 jmol-1
zpe.correction: 0.310785 hartree
zpe.thermalcorrener: 0.327964 hartree
zpe.thermalcorrenthalpy: 0.328908 hartree
zpe.thermalcorrgfe: 0.263613 hartree
zpe.sumelectzpe: -581.745181 hartree
zpe.sumelectthermal: -581.728002 hartree
zpe.sumelectthermalent: -581.727058 hartree
zpe.sumelectthermalfe: -581.792353 hartree
dipole: -1.0667 0.6003 -1.4768
dipole: 1.9181
quadrupole: -77.1434 -81.6248 -86.6994
quadrupole: 2.7300 -6.7149 2.8985
quadrupole: 4.6791 0.1977 -4.8768 2.7300 -6.7149 2.8985
hfenergy: -582.0559663 hartree
pointgroup: C01 [X(C11H22O2)]
dipole: -0.422337 0.2494208 -0.5735117 debye
polarizability: 162.684434|-1.5552789|110.946439|-0.6938668|-0.9824853|109.7013617 unknown
InChI: InChI=1S/C11H22O2/c1-4-6-7-8-9-13-11(12)10(3)5-2/h10H,4-9H2,1-3H3
charge 0 multiplicity 1
35 atoms
O  0.939319 -0.134576 -0.321056
O  2.270184 -0.839013 1.456657
C  -2.815033 -0.208291 0.442138
C  -1.490181 0.000197 -0.328711
C  -4.059001 0.162493 -0.396383
C  3.33372 -0.148916 -0.669827
C  -0.274679 -0.372794 0.519603
C  -5.388993 -0.040115 0.364602
C  4.278715 0.923047 -0.055021
C  2.170318 -0.416468 0.280052
C  4.092045 -1.475234 -0.935317
C  -6.627451 0.327857 -0.480747
C  3.608283 2.297832 0.15001
H  -2.895051 -1.267168 0.765309
H  -2.805612 0.400935 1.369996
H  -1.491248 -0.611948 -1.251212
H  -1.401714 1.057412 -0.645117
H  -4.071825 -0.447101 -1.323948
H  -3.981223 1.220971 -0.721332
H  2.913425 0.23677 -1.616666
H  -0.285461 -1.43576 0.825298
H  -0.195088 0.24501 1.433495
H  -5.463966 -1.097205 0.692093
H  -5.376436 0.571346 1.289964
H  4.659645 0.539842 0.911408
H  5.151157 1.028956 -0.729233
H  4.468224 -1.897759 0.013187
H  4.952661 -1.290499 -1.603277
H  3.440221 -2.227475 -1.414804
H  -7.56428 0.178056 0.086659
H  -6.590391 1.387132 -0.79822
H  -6.68263 -0.293652 -1.394413
H  3.211687 2.696307 -0.802474
H  4.32998 3.031845 0.552041
H  2.76718 2.231465 0.864546
