program: Gaussian 09
title: 000266496
version: EM64L-G09RevD.01
frameworkgroup: C1[X(C11H12ClN5)]
method: RPBEPBE
basis: SDD
operation: Freq
keyword: #p
keyword: freq=noraman
keyword: PBEPBE/SDD
title: #p freq=noraman PBEPBE/SDD
converged: YES YES NO NO
title: Mulliken charges:
elementType: Cl N N N N N C C C C C C C C C C C H H H H H H H H H H H H
charge: -0.056567 -0.471695 -0.700434 -0.082854 -0.662100 0.047138 0.478746 0.363464 -0.522979 0.329476 -0.491041 -0.407375 0.176431 -0.849861 0.246576 -0.276992 -0.369230 0.313511 0.216022 0.317715 0.214851 0.223000 0.223051 0.248195 0.322657 0.302306 0.303417 0.317406 0.247163
chargesum: 0.00000
title: Mulliken charges with hydrogens summed into heavy atoms:
elementType: Cl N N N N N C C C C C C C C C C C
charge: -0.056567 -0.153979 -0.075470 -0.082854 -0.041276 0.047138 0.478746 0.363464 -0.209468 0.329476 -0.275019 -0.192524 0.176431 -0.155615 0.246576 -0.276992 -0.122067
polarizability: 3.26924558e+02 5.81297067e+00 1.79251950e+02 -4.34451604e-01 -2.22442600e-02 7.12594952e+01
1716.lowfreq: -9.2006 -2.8741 0.0007 0.0011 0.0014 5.6019 30.2114 37.2695 77.5491
frequency: 30.1830 37.2572 77.5474 98.2369 151.8434 174.1804 175.3848 202.5218 212.8438 241.5624 253.3563 297.6430 300.2378 303.9818 327.5621 361.1916 365.6994 385.3784 431.2100 437.2426 451.5289 519.4364 541.6801 554.3361 573.3122 587.7431 595.3862 643.3344 667.3512 703.3026 728.1080 730.7784 755.4303 786.4610 791.8208 800.1625 892.3395 901.8456 914.8901 932.0740 954.0212 993.9641 1024.9232 1046.2648 1084.9875 1132.2667 1151.8467 1168.4142 1193.5824 1241.7377 1287.5057 1302.6155 1315.8135 1336.9208 1380.7893 1392.4089 1396.5843 1421.7284 1451.7375 1470.2057 1474.6830 1485.0824 1513.9775 1555.1488 1559.0267 1599.8063 1628.5806 1637.7547 1645.0655 2950.3987 3016.4897 3090.1983 3103.0955 3132.7939 3175.1362 3178.2945 3476.3728 3495.0313 3573.7070 3605.7037 3713.7286
redmass: 5.5168 5.4066 5.9847 5.3402 3.5314 1.1945 4.7591 4.5459 3.6046 4.8622 5.7448 2.3658 2.4387 1.5793 1.3544 8.7326 1.3398 2.5933 3.2543 3.0540 4.9012 4.7372 4.3939 5.8524 3.1012 4.9007 5.4130 1.3564 1.3941 6.5226 4.2728 4.1426 6.5276 4.9574 5.5250 1.5761 4.5666 1.4687 1.3835 1.3222 2.8781 1.6926 1.4898 1.5122 1.9969 3.4075 1.6955 1.7293 3.0682 2.5355 1.4340 5.2477 2.8929 3.0954 4.2075 1.7031 1.3962 3.5926 3.1254 2.7257 1.0526 1.5253 2.8934 3.8671 5.0064 4.2304 1.6052 1.1968 2.5057 1.0398 1.0973 1.0950 1.0874 1.0960 1.0923 1.0925 1.0455 1.0748 1.0448 1.1000 1.1036
irintensity: 0.9501 0.2200 1.4914 3.7809 0.6790 1.4550 3.6267 0.0832 1.9445 2.0653 1.3608 65.1061 34.3246 173.7114 23.5934 16.3030 25.3428 8.3767 3.5305 5.0917 4.5381 16.1456 1.0381 12.2294 7.2915 3.3681 31.5573 256.4000 55.6568 29.0529 0.4015 1.2471 4.0326 18.1482 15.7597 70.7181 26.0044 18.5888 0.6293 16.3105 9.7155 27.1511 22.0455 8.4073 168.0039 5.6523 17.2195 15.0716 11.9935 10.7277 5.4380 13.4224 95.5128 56.0370 2.8984 66.1946 11.8051 9.3782 145.8424 124.9761 14.5217 62.4733 221.0016 852.4482 5.0332 115.3760 47.7893 122.5315 155.3358 49.3618 28.5557 11.2299 21.3852 29.3058 14.0542 8.1016 25.3420 21.6118 99.4660 34.7320 21.6027
temp: 298.150 k
press: 1.00000 atm
elementType: 17 7 7 7 7 7 6 6 6 6 6 6 6 6 6 6 6 1 1 1 1 1 1 1 1 1 1 1 1
symmnumber: 1
zpe: 581952.0 jmol-1
zpe.correction: 0.221654 hartree
zpe.thermalcorrener: 0.237743 hartree
zpe.thermalcorrenthalpy: 0.238687 hartree
zpe.thermalcorrgfe: 0.177862 hartree
zpe.sumelectzpe: -1158.983513 hartree
zpe.sumelectthermal: -1158.967424 hartree
zpe.sumelectthermalent: -1158.966479 hartree
zpe.sumelectthermalfe: -1159.027305 hartree
dipole: -5.4807 -3.7511 1.0531
dipole: 6.7244
quadrupole: -95.8903 -93.5628 -111.5567
quadrupole: -11.4648 2.7760 -1.4434
quadrupole: 4.4463 6.7738 -11.2201 -11.4648 2.7760 -1.4434
hfenergy: -1159.2051668 hartree
pointgroup: C01 [X(C11H12Cl1N5)]
dipole: -2.2519119 1.3598256 -0.2807853 debye
polarizability: 327.0164148|4.27838|177.9847657|1.607341|11.178364|72.4348227 unknown
InChI: InChI=1S/C11H12ClN5/c1-6-4-7(2-3-8(6)13)17-11-9(14)10(12)15-5-16-11/h2-5,17H,13-14H2,1H3
charge 0 multiplicity 1
29 atoms
Cl 5.494123 0.707747 0.016944
N  0.297406 0.946765 0.063483
N  -5.290343 -0.064447 -0.078345
N  1.325472 -1.220937 -0.118394
N  2.781625 2.217056 -0.076577
N  3.743803 -1.39635 -0.072677
C  -1.092883 0.623768 0.031206
C  -2.992066 -0.920057 -0.266598
C  -1.603313 -0.675568 -0.223922
C  -3.908819 0.157155 -0.04301
C  -2.006983 1.68679 0.254233
C  -3.392507 1.456497 0.218989
C  1.41797 0.144114 -0.050548
C  -3.518265 -2.317442 -0.53897
C  2.707344 0.813424 -0.081778
C  3.81369 -0.053819 -0.053172
C  2.490427 -1.923481 -0.139659
H  -0.895941 -1.49346 -0.373744
H  -1.636097 2.700633 0.456258
H  0.507313 1.908994 0.346345
H  -4.0840 2.289446 0.395282
H  -4.140074 -2.69392 0.299153
H  -4.141923 -2.35221 -1.455888
H  -2.689627 -3.030423 -0.678303
H  -5.667951 -0.989016 -0.256761
H  -5.940649 0.697659 0.086738
H  2.186001 2.725875 -0.734272
H  3.71547 2.612048 0.05495
H  2.414394 -3.011641 -0.204367
