program: Gaussian 09
title: 000266491
version: EM64L-G09RevD.01
frameworkgroup: C1[X(C9H9N3O)]
method: RPBEPBE
basis: SDD
operation: Freq
keyword: #pfreq=noraman
keyword: PBEPBE/SDD
title: #p freq=noraman PBEPBE/SDD
converged: YES YES NO NO
title: Mulliken charges:
elementType: O N N N C C C C C C C C C H H H H H H H H H
charge: -0.397356 -0.020848 -0.356422 -0.553837 0.465359 -0.170263 -0.291346 0.224919 -0.441255 0.112753 -0.351787 -0.403718 -0.230980 0.238140 0.230599 0.233804 0.215555 0.224833 0.326178 0.350056 0.297802 0.297814
chargesum: 0.00000
title: Mulliken charges with hydrogens summed into heavy atoms:
elementType: O N N N C C C C C C C C C
charge: -0.047299 -0.020848 -0.030244 0.041778 0.465359 -0.170263 -0.053206 0.224919 -0.210657 0.112753 -0.117983 -0.188163 -0.006147
polarizability: 2.09711542e+02 9.88616747e-01 1.31078204e+02 -2.54034225e-02 -1.82799493e-03 5.23619491e+01
1716.lowfreq: -9.9481 -0.0010 -0.0006 -0.0004 4.2418 7.4203 63.4807 103.6688 166.9625
frequency: 63.4773 103.6686 166.9622 167.9891 209.2370 272.7423 304.1364 345.9210 381.3202 383.3082 428.7482 432.0281 460.2661 520.3290 528.1420 532.8881 569.7297 590.8914 624.3559 697.2029 697.6496 735.7870 747.1045 806.8520 832.9765 846.3378 866.4768 900.6258 949.3366 975.7875 1019.2951 1068.6183 1132.2238 1164.5856 1192.2348 1206.6448 1235.9744 1236.9313 1269.0205 1293.2004 1344.5566 1366.4251 1404.3736 1425.4759 1439.8010 1498.9349 1518.5323 1560.1517 1607.3388 1622.1339 1661.1385 3110.7206 3126.6948 3128.7914 3158.2833 3162.2515 3440.9359 3537.0712 3562.0627 3572.0892
redmass: 4.0943 4.5180 4.6182 4.6057 4.6774 4.5589 1.9106 1.6566 7.0542 1.1696 3.4523 1.3885 3.8832 5.4758 7.0989 3.3246 3.6826 7.2576 1.0846 7.5692 3.8767 5.6635 1.3491 3.7479 1.6304 5.9296 1.5062 5.1835 1.3057 1.3653 3.0863 2.1112 1.3512 1.1380 1.5203 3.7300 1.1779 1.7423 2.2062 2.6322 2.5497 5.5554 4.2522 2.2394 2.4248 3.2079 3.5302 6.3403 5.8078 6.8079 1.0977 1.0888 1.0891 1.0885 1.0986 1.0963 1.0401 1.0775 1.0657 1.1056
irintensity: 4.8642 3.6606 6.0677 4.0217 0.0054 5.1223 5.3631 9.5238 7.5208 112.5949 0.6524 305.3944 46.8487 5.2826 1.2986 0.1299 3.7531 11.2362 181.4425 6.8661 4.8810 6.9230 74.2304 0.3620 49.3812 18.1108 10.8397 6.6895 1.1633 1.6753 127.8798 3.7964 41.8065 27.9385 56.8730 10.1601 0.7375 14.4119 60.3914 23.2107 28.5367 90.5510 12.7003 84.1918 23.7646 126.1528 51.2342 95.2518 182.4348 72.6603 14.7915 19.7094 3.7414 13.2375 31.6645 16.8386 7.0151 60.9810 30.5700 1.2857
temp: 298.150 k
press: 1.00000 atm
elementType: 8 7 7 7 6 6 6 6 6 6 6 6 6 1 1 1 1 1 1 1 1 1
symmnumber: 1
zpe: 443867.0 jmol-1
zpe.correction: 0.169060 hartree
zpe.thermalcorrener: 0.180096 hartree
zpe.thermalcorrenthalpy: 0.181040 hartree
zpe.thermalcorrgfe: 0.132611 hartree
zpe.sumelectzpe: -586.883359 hartree
zpe.sumelectthermal: -586.872323 hartree
zpe.sumelectthermalent: -586.871379 hartree
zpe.sumelectthermalfe: -586.919809 hartree
dipole: 0.0216 -2.1935 0.0023
dipole: 2.1936
quadrupole: -55.1462 -68.5580 -78.7757
quadrupole: 10.9733 -0.0245 -0.0030
quadrupole: 12.3471 -1.0647 -11.2824 10.9733 -0.0245 -0.0030
hfenergy: -587.0524195 hartree
pointgroup: C01 [X(C9H9N3O1)]
dipole: -0.0197209 0.8608011 0.0586764 debye
dipolederiv: -0.0072199 0.0037035 0.0107956 0.2581095 -1.3982863 -0.0641706 0.0286902 -0.0711839 -0.3890163 -1.2306708 -0.3730196 -0.0523501 0.182777 -0.3063187 0.0010879 -0.0133346 -0.0138401 -0.2544582 -0.997124 -0.274627 -0.0322061 -0.9225514 -0.1206783 0.0003656 -0.0739256 0.018807 -0.4998442 -0.23371 -0.3021564 -0.0269874 -0.6583355 -0.506775 -0.053488 -0.0523286 -0.0439452 0.0150945 -0.2641353 0.0625717 -0.0045801 0.1562348 -0.2190845 -0.0155305 0.0017725 -0.0182813 0.066632 0.6804765 0.4615182 0.0500213 -0.0105569 -0.0032548 -0.0028471 0.0166303 0.0102917 0.0308373 0.4944973 -0.0747908 0.0120771 -0.0123189 0.2271283 0.0245599 0.0164037 0.0227226 -0.1301424 -0.069592 -0.1224188 -0.0114588 -0.2460539 1.3618524 0.0864185 -0.0204271 0.089856 0.0432834 0.0420478 -0.0495464 0.0035885 0.1102338 0.0127491 0.0187059 0.0147844 0.0141368 -0.2107827 1.5891985 0.5035659 0.0717325 0.9092484 0.3848438 0.038334 0.0980668 0.0267129 0.1958917 -0.3507312 -0.0220419 -0.0054721 -0.5709531 -0.1690627 -0.0136329 -0.0427806 0.0015106 -0.1988787 -0.0067262 -0.2824655 -0.0138903 0.0399065 -0.1828295 0.0035078 0.0089054 -0.0054973 -0.2188125 -0.0561034 0.0983048 0.0099383 -0.0447192 0.0906356 0.016318 -0.0000135 0.0203923 -0.1565801 0.0831943 -0.0409301 -0.0044868 0.0153786 -0.101323 -0.016397 -0.0006788 -0.0178897 0.1402445 0.0660807 0.0264107 -0.0010816 -0.053484 -0.1195245 -0.0217149 -0.0066925 -0.0194208 0.1684808 -0.0584667 0.1056206 0.000937 0.0878265 0.046837 -0.0060532 -0.0001551 -0.0054605 0.1690117 -0.061331 0.1039234 0.0006373 0.1393663 -0.0259189 -0.0102342 0.0030577 -0.0112649 0.1748785 -0.1023242 -0.0904077 -0.0138893 -0.0838059 0.044784 -0.010765 -0.0134989 -0.0109794 0.1630629 0.0790982 0.0724285 -0.0022485 0.1300334 0.1715344 -0.0080136 0.0017117 -0.0097369 0.3400239 0.0272539 0.0540771 -0.0058597 -0.0610166 0.3872752 -0.0006648 -0.0139159 0.0025314 0.3725838 0.186147 0.0652294 0.0493956 0.3130816 0.1995861 0.1374801 0.0401801 0.0858955 0.1039848 0.1901407 0.0750502 -0.0346124 0.321599 0.2258303 -0.1032659 0.0075483 -0.0653569 0.0745054 unknown
polarizability: 209.5721779|1.2796594|130.7100304|4.4394602|5.5077665|52.8694864 unknown
InChI: InChI=1S/C9H9N3O/c10-12-8-5-4-6-2-1-3-7(13)9(6)11-8/h1-5,12-13H,10H2
charge 0 multiplicity 1
22 atoms
O  1.595145 -2.515587 -0.176185
N  -0.7166 -1.022005 -0.134876
N  -3.036975 -1.019238 -0.195847
N  -4.325336 -0.47884 -0.195306
C  0.593825 1.080069 0.048349
C  0.490573 -0.362573 -0.055704
C  -0.64109 1.813495 0.064801
C  1.717085 -1.12415 -0.074882
C  1.872581 1.716907 0.12883
C  -1.851003 -0.286814 -0.114397
C  -1.861915 1.152687 -0.014998
C  2.958318 -0.475886 0.005435
C  3.036383 0.945905 0.107577
H  -0.608831 2.906854 0.141399
H  1.924721 2.809113 0.206555
H  -2.809753 1.698123 -0.003804
H  3.883669 -1.067475 -0.009977
H  4.020207 1.422787 0.16902
H  -2.943595 -2.034805 -0.262649
H  2.49293 -2.934316 -0.180537
H  -4.5888 0.040595 -1.037258
H  -4.63654 -0.074948 0.692452
