program: Gaussian 09
title: 000266482
version: EM64L-G09RevD.01
frameworkgroup: C1[X(C11H15N5O3S)]
method: RPBEPBE
basis: SDD
operation: Freq
keyword: #p
keyword: freq=noraman
keyword: PBEPBE/SDD
title: #p freq=noraman PBEPBE/SDD
converged: YES YES NO NO
title: Mulliken charges:
elementType: S O O O N N N N N C C C C C C C C C C C H H H H H H H H H H H H H H H
charge: 0.292660 -0.313706 -0.436351 -0.434797 -0.212351 -0.045272 -0.215797 -0.050939 -0.591094 -0.038847 -0.136860 -0.516988 -0.070850 -0.321512 0.258422 -0.209215 0.094841 -0.362730 0.007024 -0.827609 0.256029 0.222095 0.253201 0.242615 0.256355 0.192677 0.222916 0.378424 0.283026 0.351717 0.334137 0.335933 0.278485 0.245910 0.278452
chargesum: 0.00000
title: Mulliken charges with hydrogens summed into heavy atoms:
elementType: S O O O N N N N N C C C C C C C C C C C
charge: 0.292660 -0.313706 -0.057927 -0.083080 -0.212351 -0.045272 -0.215797 -0.050939 0.078976 0.217182 0.085235 -0.021172 0.185505 0.094081 0.258422 0.073811 0.094841 -0.362730 0.007024 -0.024763
polarizability: 2.66458755e+02 1.17298513e+00 1.96767448e+02 -1.42700051e+01 8.03271408e+00 1.02937350e+02
1716.lowfreq: -13.2202 0.0013 0.0017 0.0022 3.4357 4.7559 20.6285 34.1836 48.9343
frequency: 19.7167 34.1239 48.9244 82.2388 93.7783 103.8815 112.2679 117.8700 138.6288 158.2243 178.5104 214.0579 229.5653 238.8695 248.8412 296.0408 329.6666 340.6394 350.5532 393.9276 422.8643 427.0706 448.5203 462.0947 484.9791 502.9656 511.5449 553.2350 592.6151 610.4114 626.3881 640.5872 662.1447 681.9455 711.0966 760.4967 778.0718 783.9483 816.9165 826.3428 857.7190 875.4050 895.5337 923.7215 953.3288 964.1410 977.3094 979.3486 1001.7205 1006.6804 1027.7848 1045.1154 1066.8045 1077.4815 1108.5876 1116.3337 1163.2617 1177.9313 1193.3281 1201.9437 1241.6475 1253.5613 1281.7340 1287.3484 1296.1926 1299.9918 1318.8915 1327.3002 1329.3289 1347.3068 1353.0354 1355.9945 1380.6735 1386.7398 1433.7441 1434.9974 1449.6723 1460.3278 1468.3026 1470.8779 1512.3238 1528.7798 1561.6951 1615.1022 2941.6039 2951.0646 2980.4502 3000.6583 3025.5855 3030.3408 3052.4941 3071.5290 3098.5040 3150.5862 3156.3328 3260.8755 3539.8258 3564.3817 3719.8570
redmass: 5.9390 5.9335 5.0191 4.2765 3.3580 5.7708 1.1105 3.4567 6.8356 4.7399 5.8497 4.9289 3.7575 5.3041 6.5660 5.6051 4.1528 5.3391 4.0356 4.7235 5.8795 3.1120 1.2053 1.2118 2.9545 1.0687 6.8299 6.3402 7.9524 6.6820 4.8315 5.9963 7.1637 4.8306 11.6138 3.9702 6.2923 4.4568 4.3276 1.6551 1.1836 2.3958 6.4488 2.4444 3.2538 2.1023 1.1890 2.7045 1.8719 3.3726 2.5454 2.3661 4.0358 3.0464 2.3681 3.8771 1.2625 2.0275 2.0395 1.8944 1.4078 1.5782 2.1800 1.6515 1.3101 1.3989 3.1157 1.8853 1.5242 1.3139 1.7054 1.3493 1.3262 6.5991 3.8746 1.0538 1.0616 1.0900 1.3881 1.2809 2.5022 6.2812 8.5950 1.4930 1.0786 1.0731 1.0850 1.0689 1.0281 1.0614 1.0868 1.0953 1.1049 1.1042 1.1056 1.0985 1.0652 1.0446 1.1058
irintensity: 0.4745 0.0678 1.2088 1.0613 3.6743 1.4812 0.8005 5.6310 0.6798 4.9439 5.9967 0.9241 0.8477 2.1402 0.7303 7.2093 12.2402 6.0426 6.7039 1.2128 3.2182 11.4841 114.0418 269.4102 6.7883 33.1777 2.3919 3.4576 1.2783 4.6778 11.1241 4.8496 1.9715 8.4469 5.1210 21.1444 7.8333 45.7359 3.8984 21.7468 130.2155 11.6597 132.9134 5.5236 53.0821 71.0550 5.5317 35.1937 31.0784 24.8751 55.0040 33.0985 15.2526 32.2052 1.8246 55.9604 3.5179 20.5256 148.9069 7.0841 21.8814 15.1321 11.6129 8.7132 4.1338 41.9118 21.0039 31.0497 71.1176 20.6902 15.6127 41.7934 29.8349 49.6289 69.8495 14.5400 44.4940 5.3401 20.1714 50.0222 275.5479 237.2538 231.2463 444.6536 42.7869 50.3941 56.2135 912.3495 17.4491 12.1523 13.1174 59.9409 16.8662 7.5339 11.0144 2.5147 6.0112 129.6521 47.1632
temp: 298.150 k
press: 1.00000 atm
elementType: 16 8 8 8 7 7 7 7 7 6 6 6 6 6 6 6 6 6 6 6 1 1 1 1 1 1 1 1 1 1 1 1 1 1 1
symmnumber: 1
zpe: 703330.7 jmol-1
zpe.correction: 0.267885 hartree
zpe.thermalcorrener: 0.286987 hartree
zpe.thermalcorrenthalpy: 0.287932 hartree
zpe.thermalcorrgfe: 0.219198 hartree
zpe.sumelectzpe: -1324.157792 hartree
zpe.sumelectthermal: -1324.138689 hartree
zpe.sumelectthermalent: -1324.137745 hartree
zpe.sumelectthermalfe: -1324.206479 hartree
dipole: -2.0194 4.7109 0.5672
dipole: 5.1567
quadrupole: -111.5426 -131.6705 -125.7051
quadrupole: -4.0376 -5.7608 4.7500
quadrupole: 11.4301 -8.6978 -2.7323 -4.0376 -5.7608 4.7500
hfenergy: -1324.4256765 hartree
pointgroup: C01 [X(C11H15N5O3S1)]
dipole: -0.9256198 -1.7375562 -0.4901271 debye
polarizability: 265.4124334|-8.8013073|193.4754502|16.2308417|19.8302346|107.2756698 unknown
InChI: InChI=1S/C11H15N5O3S/c1-20-9-7-8(14-11(12)15-9)16(4-13-7)10-6(18)2-5(3-17)19-10/h4-6,10,17-18H,2-3,12H2,1H3
charge 0 multiplicity 1
35 atoms
S  -4.132895 2.110051 0.055573
O  2.954803 0.532924 0.88654
O  1.405715 -2.631838 -0.174221
O  4.63635 2.205116 -0.66174
N  0.578886 0.4318 0.665345
N  -0.884036 2.200493 0.803688
N  -0.990482 -1.328849 -0.113052
N  -3.272611 -0.464253 -0.394363
N  -2.759155 -2.702085 -0.834401
C  1.80638 -0.372332 0.834632
C  2.062378 -1.358656 -0.345522
C  3.596105 -1.498112 -0.29776
C  4.088874 -0.08829 0.085436
C  4.364941 0.839831 -1.107553
C  -0.665123 -0.060302 0.273423
C  0.382163 1.795179 0.985029
C  -1.560351 1.048243 0.359109
C  -2.908239 0.783369 -0.004306
C  -2.320313 -1.462429 -0.433722
C  -5.664767 1.173873 -0.505878
H  1.735306 -0.945895 1.782103
H  1.745844 -0.854857 -1.285781
H  3.853802 -2.241013 0.476557
H  4.005402 -1.842234 -1.262279
H  4.958438 -0.088731 0.764639
H  3.510439 0.811024 -1.818429
H  5.278737 0.514509 -1.634544
H  0.406619 -2.416895 -0.18611
H  1.202731 2.41499 1.333649
H  3.898856 2.465212 -0.050153
H  -2.112031 -3.483831 -0.885501
H  -3.739524 -2.816297 -1.075033
H  -5.506044 0.771537 -1.515795
H  -6.47586 1.918322 -0.500728
H  -5.877938 0.354627 0.194446
