program: Gaussian 09
title: 000266463
version: EM64L-G09RevD.01
frameworkgroup: C1[X(C13H19ClN2O)]
method: RPBEPBE
basis: SDD
operation: Freq
keyword: #p
keyword: freq=noraman
keyword: PBEPBE/SDD
title: #p freq=noraman PBEPBE/SDD
converged: NO YES NO NO
title: Mulliken charges:
elementType: Cl O N N C C C C C C C C C C C C C H H H H H H H H H H H H H H H H H H H
charge: -0.091225 -0.322687 -0.439245 -0.405139 0.337383 -0.602832 -0.778430 -0.710737 0.496542 0.306140 -0.418851 -0.386436 -0.239607 -0.248861 -0.347598 -0.247619 -0.546339 0.259063 0.203131 0.224261 0.222162 0.241370 0.201613 0.212314 0.273759 0.294264 0.228656 0.241716 0.297844 0.222812 0.236417 0.240142 0.259782 0.227015 0.294200 0.265021
chargesum: 0.00000
title: Mulliken charges with hydrogens summed into heavy atoms:
elementType: Cl O N N C C C C C C C C C C C C C
charge: -0.091225 -0.322687 -0.144981 -0.107295 0.337383 -0.140638 -0.090637 -0.023051 0.496542 0.306140 -0.190195 -0.144720 -0.016795 -0.012444 0.152326 -0.020604 0.012882
polarizability: 1.82521664e+02 2.42955695e+00 1.83237545e+02 -6.50092764e+00 1.76815116e+01 1.14450106e+02
1716.lowfreq: -9.5171 -8.4837 -4.4433 0.0001 0.0018 0.0023 17.2070 27.9409 37.9688
frequency: 16.3507 27.8905 37.9357 54.5541 73.9920 93.2557 103.3149 123.7720 152.3568 205.0607 211.3615 237.8380 244.4561 269.9166 275.1462 306.9065 333.1660 345.1577 365.9772 389.2497 406.7135 445.5048 458.8299 489.2353 513.6110 527.5691 591.4048 605.6961 617.8621 704.0786 707.5272 717.3135 732.4881 793.9227 816.3409 841.2765 856.9818 885.0576 900.7127 922.2352 933.3952 954.2746 957.9176 976.2857 985.6503 990.4680 994.7310 1014.3035 1026.2575 1042.0805 1076.7488 1131.2476 1140.5503 1165.7440 1170.6471 1184.2335 1188.0280 1205.4029 1217.0666 1238.5991 1244.2334 1274.2735 1304.8938 1316.3932 1328.7212 1366.9373 1372.5421 1380.9596 1392.9830 1423.2791 1438.0261 1439.9125 1449.3638 1462.6779 1470.9880 1477.1684 1478.2028 1482.3182 1493.2100 1503.7225 1589.1805 1612.3342 1621.6433 2978.1316 2983.4519 2995.8549 3010.3329 3058.6880 3060.1231 3071.6102 3076.6813 3077.3756 3089.1549 3108.5225 3111.3804 3123.8727 3134.9592 3145.6537 3152.7480 3161.6343 3536.9697 3555.2668
redmass: 5.6247 5.2548 6.1902 6.0963 6.0083 4.4199 3.1611 2.9887 3.9998 1.0344 2.8651 3.5957 1.6448 2.5139 1.6495 2.0090 2.2068 2.2746 2.2860 2.9450 2.8154 2.4423 3.2459 2.8042 1.4183 2.8432 4.1546 4.2750 6.2351 3.8829 2.2248 6.3658 2.0580 2.6433 3.5419 2.0637 1.2469 1.8517 2.7704 1.4821 1.5301 1.8482 2.5669 1.3903 2.0007 4.7416 1.3552 1.3945 2.1622 1.9408 1.5861 1.4294 1.9409 1.6517 1.0543 1.9965 1.1734 2.3096 2.6191 1.5514 1.5875 1.8452 1.2345 1.6316 1.2709 1.2835 1.2043 7.2089 1.2264 1.1486 2.0354 1.1247 1.1463 1.1872 1.0824 1.1476 1.1380 2.2085 1.1116 1.9580 5.9314 6.1591 4.4936 1.0357 1.0370 1.0597 1.0597 1.1019 1.0599 1.1002 1.1005 1.0995 1.0985 1.0995 1.0867 1.0863 1.0914 1.0956 1.1109 1.1013 1.0774 1.0772
irintensity: 0.3959 0.1189 1.5015 3.4480 16.1495 2.7761 2.0016 3.2347 5.7648 0.3789 10.1933 3.3054 0.8622 0.5599 0.7375 2.6625 22.5629 4.9955 2.0366 3.3378 0.7200 4.8313 3.8726 0.8113 266.4239 2.7503 31.5531 4.2632 0.1782 13.5088 36.9364 16.4035 37.3201 13.2152 4.0265 13.7239 0.2872 0.9653 3.3926 0.9369 1.7702 1.0329 8.1012 0.6517 3.2436 0.2837 0.1176 0.8256 6.8596 0.5087 3.9389 25.4270 0.7133 6.0339 0.7298 17.0001 3.3270 52.4905 0.8460 37.0130 175.0626 10.6561 18.7566 51.1622 0.1338 7.1026 33.7694 0.2281 41.0893 26.6104 11.8899 18.9582 25.1830 11.0375 15.9364 4.1375 13.0530 16.6519 99.1225 398.2397 1.5063 5.3559 123.3372 18.9352 33.6519 33.4118 31.0420 7.8757 20.3867 21.0715 9.4710 36.4936 36.6484 6.8116 9.1401 2.6682 16.6571 46.2295 16.2867 16.3242 11.3353 17.1836
temp: 298.150 k
press: 1.00000 atm
elementType: 17 8 7 7 6 6 6 6 6 6 6 6 6 6 6 6 6 1 1 1 1 1 1 1 1 1 1 1 1 1 1 1 1 1 1 1
symmnumber: 1
zpe: 785659.6 jmol-1
zpe.correction: 0.299242 hartree
zpe.thermalcorrener: 0.317533 hartree
zpe.thermalcorrenthalpy: 0.318477 hartree
zpe.thermalcorrgfe: 0.250776 hartree
zpe.sumelectzpe: -1150.302749 hartree
zpe.sumelectthermal: -1150.284458 hartree
zpe.sumelectthermalent: -1150.283514 hartree
zpe.sumelectthermalfe: -1150.351215 hartree
dipole: -0.4676 -0.6287 2.5290
dipole: 2.6476
quadrupole: -97.3949 -114.7105 -109.4386
quadrupole: -1.9918 -1.9495 -2.7446
quadrupole: 9.7864 -7.5291 -2.2573 -1.9918 -1.9495 -2.7446
hfenergy: -1150.6019911 hartree
pointgroup: C01 [X(C13H19Cl1N2O1)]
dipole: 0.0497563 0.3099111 0.9932347 debye
polarizability: 180.1511015|2.0934559|184.471318|14.502507|-14.7776244|115.5868958 unknown
InChI: InChI=1S/C13H19ClN2O/c1-13(2,16-12(17)15-9-8-14)10-11-6-4-3-5-7-11/h3-7,15-16H,8-10H2,1-2H3
charge 0 multiplicity 1
36 atoms
Cl -2.850794 -3.051543 0.324798
O  -1.946858 1.3184 -1.124095
N  -0.59665 1.401133 0.803318
N  -2.587898 0.151263 0.795252
C  0.561043 2.142911 0.223276
C  1.246727 1.301557 -0.921782
C  1.542234 2.394123 1.392459
C  0.087992 3.498162 -0.363343
C  1.755404 -0.065978 -0.497273
C  -1.708297 0.984438 0.08393
C  3.105885 -0.260069 -0.102133
C  0.884726 -1.18846 -0.469404
C  3.569149 -1.527368 0.320287
C  1.338634 -2.456345 -0.041509
C  -3.774113 -0.386415 0.12928
C  2.68454 -2.630467 0.357818
C  -3.499653 -1.617695 -0.742658
H  0.501223 1.202353 -1.7317
H  2.081214 1.91604 -1.310442
H  1.057151 2.997477 2.182461
H  2.421959 2.954276 1.031038
H  1.903106 1.446677 1.833025
H  0.949493 4.053614 -0.778104
H  -0.377584 4.114782 0.426728
H  -0.653155 3.332735 -1.161542
H  -0.483774 1.066179 1.761702
H  3.802006 0.587978 -0.134441
H  -0.151424 -1.072918 -0.806605
H  -2.28227 -0.308274 1.65434
H  4.61755 -1.654886 0.614291
H  0.642841 -3.302985 -0.027846
H  -4.54061 -0.619851 0.889071
H  -4.171488 0.400443 -0.539113
H  3.041666 -3.613899 0.684317
H  -2.715828 -1.423527 -1.487962
H  -4.414547 -2.002061 -1.218937
