program: Gaussian 09
title: 000266441
version: EM64L-G09RevD.01
frameworkgroup: C1[X(C6H8N4O2)]
method: RPBEPBE
basis: SDD
operation: Freq
keyword: #pfreq=noraman
keyword: PBEPBE/SDD
title: #p freq=noraman PBEPBE/SDD
converged: YES YES NO NO
title: Mulliken charges:
elementType: O O N N N N C C C C C C H H H H H H H H
charge: -0.250886 -0.254311 -0.423125 -0.393041 0.003366 -0.319754 0.433565 -0.405778 0.128823 0.181688 -0.349994 -0.569123 0.366300 0.251457 0.359182 0.226750 0.295382 0.238326 0.224399 0.256773
chargesum: 0.00000
title: Mulliken charges with hydrogens summed into heavy atoms:
elementType: O O N N N N C C C C C C
charge: -0.250886 -0.254311 -0.056825 -0.033859 0.003366 -0.024372 0.433565 -0.154321 0.128823 0.181688 -0.123245 0.150375
polarizability: 2.06235576e+02 -1.46883022e+01 1.11128391e+02 -1.74349146e-02 8.05791625e-02 4.58722357e+01
1716.lowfreq: -8.5677 -0.0004 -0.0003 0.0006 2.3111 2.5552 61.4703 76.6701 84.9856
frequency: 61.4653 76.6670 84.9853 131.8185 167.2290 175.0036 247.3522 268.5919 279.6525 310.9829 374.1741 488.4288 507.3976 535.0791 549.5178 601.9217 625.4880 673.0170 697.7352 709.8824 744.6592 772.7920 810.9537 870.1387 935.6468 968.0890 993.8072 1031.7745 1114.0381 1154.8620 1183.0437 1210.8824 1234.7985 1311.3576 1333.1970 1341.8532 1369.3367 1431.7744 1463.2819 1475.4320 1482.9972 1510.6172 1555.8145 1606.7707 1645.9314 1672.7812 2970.9511 3052.3671 3068.5161 3117.8074 3203.5683 3417.4829 3520.8820 3535.5970
redmass: 4.1338 1.1592 3.2061 4.0254 7.2245 4.8049 2.9333 3.7332 5.7892 7.9004 8.9926 4.3041 7.7622 2.9301 1.8907 3.9651 3.4298 2.7553 1.9818 5.8769 1.4892 1.7247 1.7234 1.5680 4.1779 3.0971 2.7585 3.0029 1.3258 2.5752 1.6363 4.5083 2.7086 1.6027 1.5598 2.3242 2.3933 1.1607 1.0819 2.3179 1.3755 1.4770 5.2793 6.1881 6.5525 5.8396 1.0419 1.0898 1.0924 1.1013 1.0936 1.0756 1.0772 1.0772
irintensity: 0.1799 0.3874 0.6298 1.5159 7.5351 5.3422 40.9833 16.0145 1.0090 2.6534 24.5428 16.2177 18.4002 42.9520 54.6996 8.8072 0.2562 0.2426 51.6057 5.1941 0.9876 140.1588 68.0085 81.8148 3.4019 20.2964 4.6828 18.9908 54.8819 31.2987 9.5073 37.2007 86.7807 2.0248 36.1782 92.8694 149.8936 15.5691 32.0796 67.3207 50.9374 1.0883 306.4499 31.6079 650.6713 704.3959 100.8960 30.5626 30.8201 11.7808 1.1693 19.4848 79.7227 63.8533
temp: 298.150 k
press: 1.00000 atm
elementType: 8 8 7 7 7 7 6 6 6 6 6 6 1 1 1 1 1 1 1 1
symmnumber: 1
zpe: 392854.8 jmol-1
zpe.correction: 0.149630 hartree
zpe.thermalcorrener: 0.160988 hartree
zpe.thermalcorrenthalpy: 0.161932 hartree
zpe.thermalcorrgfe: 0.111706 hartree
zpe.sumelectzpe: -602.011784 hartree
zpe.sumelectthermal: -602.000426 hartree
zpe.sumelectthermalent: -601.999482 hartree
zpe.sumelectthermalfe: -602.049708 hartree
dipole: -8.9878 -2.1748 0.1654
dipole: 9.2486
quadrupole: -59.8729 -78.3556 -71.7275
quadrupole: 9.0816 -0.8330 -0.0287
quadrupole: 10.1124 -8.3702 -1.7422 9.0816 -0.8330 -0.0287
hfenergy: -602.1614141 hartree
pointgroup: C01 [X(C6H8N4O2)]
dipole: 3.5475462 -0.7928875 -0.1621083 debye
dipolederiv: -0.532155 0.1418089 0.0013886 0.3374824 -1.3718298 0.0068561 -0.0033569 0.0147645 -0.3975107 -1.3290276 -0.4541654 0.0337908 -0.3021853 -0.7349972 0.0140656 0.0280704 0.0166809 -0.3793505 -0.9076801 0.6188133 0.0062484 0.2368937 -1.0549185 0.0050729 0.0109535 0.0006182 -0.2905769 -0.5275492 -0.3071415 0.0104437 -0.0082582 -1.2074171 0.0129644 0.0039516 0.0225882 -0.3594893 1.6719496 0.3010557 -0.0350072 -0.080018 -0.3736492 0.014708 0.0407527 0.0356685 -0.0799798 -1.6639819 -0.4188208 0.0636722 0.5444632 0.10046 0.0317906 -0.331233 -0.0153786 -0.4430428 1.2059374 0.025898 -0.031981 0.0522785 0.8938122 -0.0127241 -0.021288 -0.0136118 0.1256618 -1.3600451 -0.2493291 0.0368132 0.0571702 -0.1795129 -0.0027588 0.022151 0.0027371 -0.262885 1.2128865 -0.3018551 -0.0168594 -0.4031512 1.9180554 -0.0154727 -0.0129573 -0.0227654 0.328018 1.9942723 0.4090986 -0.0541833 -0.1546556 1.2800671 -0.0122227 -0.0393977 -0.0274468 0.2610727 -0.7747945 -0.0049317 0.02016 -0.5804532 0.1989677 0.0061907 0.0465268 -0.0102033 -0.1892474 0.5441892 0.1867458 -0.0834942 0.4466177 0.2681391 -0.1048961 0.0737762 -0.0604804 0.2896183 0.261411 -0.0242172 0.0000754 0.018005 0.2115192 0.0021614 0.0010826 0.0024646 0.3179068 0.0657171 0.0388042 0.0018951 0.0646371 -0.0030958 0.0016567 0.0020668 0.003031 0.1900536 0.2350137 -0.0127368 0.0024335 -0.0320333 0.1470913 0.0044566 0.0031857 0.0039583 0.34385 -0.0266088 0.0499264 0.0060967 0.0714114 -0.1263544 0.0053636 0.0028427 0.0017806 0.2091572 0.0274398 -0.0287474 0.0168057 -0.0903391 -0.0266171 -0.0001369 0.0864219 -0.0184758 0.3613198 -0.0436917 -0.0524499 0.0260558 -0.1965003 0.0333976 0.0410728 0.1661531 0.086181 -0.163766 -0.1397199 0.0028633 -0.0689847 0.0569041 0.0621454 0.0677347 -0.0929565 0.0549139 0.0718237 0.0864371 0.0793806 0.0646307 -0.038269 -0.0352629 -0.0658829 0.0132544 -0.0770247 0.0673666 unknown
polarizability: 205.4789369|16.3309866|111.6507524|-5.5905004|-2.1442897|46.1065137 unknown
InChI: InChI=1S/C6H8N4O2/c1-7-8-3-4-2-5(11)10-6(12)9-4/h2-3,7,9-10H,1H3
charge 0 multiplicity 1
20 atoms
O  -1.565971 2.659938 -0.037368
O  -3.436862 -1.638662 0.084111
N  -0.142976 0.799144 -0.035217
N  -2.467422 0.488937 0.023168
N  2.411001 -0.114584 -0.083293
N  3.713354 -0.470795 -0.080752
C  0.067282 -0.581314 -0.015283
C  -1.013684 -1.449696 0.025377
C  -1.407701 1.409739 -0.017803
C  -2.379995 -0.941585 0.047381
C  1.453021 -1.031589 -0.041672
C  4.728497 0.564985 -0.278142
H  0.680023 1.408741 -0.065323
H  -0.874196 -2.531223 0.042045
H  -3.410113 0.88939 0.037604
H  1.638865 -2.118028 -0.022033
H  3.988393 -1.461628 -0.125249
H  4.906299 0.781899 -1.3502
H  5.677144 0.240458 0.181859
H  4.393142 1.490472 0.215991
