program: Gaussian 09
title: 000266431
version: EM64L-G09RevD.01
frameworkgroup: C1[X(C24H25NO4)]
method: RPBEPBE
basis: SDD
operation: Freq
keyword: #p
keyword: freq=noraman
keyword: PBEPBE/SDD
title: #p freq=noraman PBEPBE/SDD
converged: YES YES NO NO
title: Mulliken charges:
elementType: O O O O N C C C C C C C C C C C C C C C C C C C C C C C C H H H H H H H H H H H H H H H H H H H H H H H H H
charge: -0.187673 -0.264492 -0.217536 -0.176147 0.010028 -0.201766 0.263298 -0.110602 -0.197646 -0.475425 -0.503689 -0.484138 -0.503277 0.073399 -0.537976 -0.766223 0.270341 -0.587567 0.298479 -0.372238 -0.540900 -0.433550 0.332679 0.253465 0.228685 -0.317872 -0.322823 -0.219680 -0.229849 0.256025 0.224941 0.222884 0.229095 0.217714 0.222184 0.226168 0.198566 0.224882 0.212981 0.220765 0.249169 0.257946 0.222000 0.224173 0.239003 0.229296 0.234243 0.237463 0.270025 0.265396 0.274296 0.283152 0.236345 0.241986
chargesum: 0.00000
title: Mulliken charges with hydrogens summed into heavy atoms:
elementType: O O O O N C C C C C C C C C C C C C C C C C C C C C C C C
charge: -0.187673 -0.264492 -0.217536 -0.176147 0.010028 0.054259 0.263298 0.114339 0.025237 -0.028617 -0.055337 -0.060690 -0.069532 0.073399 -0.030861 -0.081046 0.270341 -0.124028 0.298479 -0.134775 -0.270875 -0.168155 0.332679 0.253465 0.228685 -0.043576 -0.039671 0.016665 0.012136
polarizability: 3.76222760e+02 -1.40939509e+01 2.50747898e+02 -9.22975563e+00 1.46830048e+01 2.10709221e+02
1716.lowfreq: -15.8472 -6.5117 -0.0009 0.0002 0.0004 1.5727 5.5189 20.1619 22.1389
frequency: -6.1090 19.9850 21.9003 40.1102 51.7904 53.6844 77.0029 92.1722 120.1390 129.3810 153.6359 161.7804 199.5274 210.3244 219.1286 232.8820 260.8684 278.0736 281.2227 290.4282 301.1226 323.6510 330.1024 351.8490 376.4940 394.5708 415.3718 421.2807 434.4040 456.6941 463.0053 480.8806 500.7368 506.4047 528.6239 534.6307 549.8211 555.4273 582.8197 596.5674 631.4648 636.5525 651.8785 659.1428 675.4176 691.8455 705.4416 711.5407 732.6077 760.5431 768.2212 772.4991 804.3527 821.8667 830.7191 835.4633 847.9280 857.2351 865.1523 889.0007 897.3563 906.6500 922.4693 939.7705 954.0576 960.7552 963.1962 972.4395 986.9059 989.7676 1001.2699 1026.1561 1031.2102 1037.8164 1049.8028 1057.6176 1065.8363 1073.8152 1095.7980 1106.7759 1119.5648 1133.7316 1137.2846 1143.0590 1154.0856 1162.3868 1169.2203 1172.2581 1183.4086 1190.7516 1205.2181 1212.4089 1219.6756 1231.2807 1239.7997 1246.8234 1260.3482 1264.9934 1267.1238 1271.0237 1276.2792 1294.4375 1304.2444 1309.6878 1325.1940 1334.9131 1345.7758 1350.2510 1358.3331 1364.4231 1367.3324 1371.0060 1381.9248 1387.4863 1410.5502 1431.1284 1437.2960 1449.4636 1461.1392 1463.7335 1468.5035 1472.4115 1474.6812 1481.9849 1489.4990 1490.7522 1578.2350 1591.3258 1601.7673 1611.0572 1650.4068 2931.0149 2954.8626 2964.6561 2976.3858 2983.3417 2984.5962 2989.0214 3000.0597 3006.0983 3019.6991 3021.2824 3038.4944 3039.4046 3045.2006 3056.5524 3071.8398 3076.1074 3081.7921 3130.2843 3143.0485 3144.1064 3162.5623 3172.1342 3173.9974 3185.9369
redmass: 5.5291 6.2734 6.3849 9.9607 6.4305 4.4468 6.3407 4.3907 3.5538 3.3944 4.6447 5.2806 2.9401 1.8126 1.8002 2.6287 4.9903 2.9091 2.4545 3.2103 3.6159 3.2318 3.5816 4.3263 5.2648 2.8952 3.9678 4.1524 2.8438 4.2625 3.0518 4.8313 3.8437 3.8569 3.2979 4.7331 4.8391 2.8525 4.1877 3.7418 3.9460 4.8088 4.9632 4.0653 4.2051 3.9210 3.0450 4.1198 3.9480 2.9458 6.1807 1.4327 1.8457 5.0552 1.9781 1.6779 2.3730 2.1377 1.4373 2.4511 1.5645 3.4624 2.1774 2.2854 1.8733 1.3690 1.5439 2.0090 1.3315 1.8442 1.7186 2.0413 2.1578 2.5519 2.3040 2.6719 3.4845 2.0756 1.8953 1.7749 1.5698 1.6437 1.7938 1.7179 1.6701 1.3711 1.6908 1.1024 1.6334 1.5327 5.4079 2.8609 1.3251 2.8123 1.8985 2.0689 1.5303 1.6478 1.4733 1.4397 1.6279 1.4679 1.4461 1.5649 1.4089 1.5142 1.4765 1.4725 1.4303 8.0940 1.8677 2.9624 1.2317 7.2101 3.7242 1.0770 2.6603 1.0844 1.2359 2.1686 1.0681 1.0970 1.0631 1.2583 1.0862 1.7646 7.2158 7.5234 6.6731 6.7061 11.6552 1.0811 1.0809 1.0646 1.0350 1.0599 1.0648 1.0658 1.0620 1.0758 1.0908 1.0748 1.0965 1.1018 1.1021 1.0981 1.1012 1.1006 1.1000 1.0916 1.0870 1.0882 1.0902 1.0951 1.0961 1.0987
irintensity: 1.8046 1.5496 0.5760 0.5325 1.6600 1.4448 3.3522 2.4771 1.0680 0.4886 0.3744 0.6820 0.3661 0.2878 0.3589 1.1350 1.5620 1.9681 0.5753 0.9452 1.8360 3.2928 1.2203 1.7983 0.0243 0.1793 1.4609 1.5323 5.9885 0.4367 4.0539 3.8410 4.7600 5.5776 3.1802 0.8903 0.2070 1.7556 0.7221 1.4680 12.9841 0.2892 2.7599 8.7403 3.0593 4.4587 7.7658 3.1930 21.4625 4.1679 23.7890 59.1461 1.1044 6.7182 2.1318 32.9671 8.6351 2.2773 1.8353 2.5583 17.4019 54.9555 6.3107 6.8235 2.4788 2.8232 2.7031 9.3937 0.4768 10.7842 22.8614 10.7022 8.7487 6.7452 9.9609 2.9452 25.2395 23.2865 9.5747 0.5138 2.9341 17.6072 4.6969 9.8505 21.7537 24.5348 24.3238 41.1775 7.2445 2.0649 390.2522 44.4985 8.5737 149.9963 7.9109 60.7203 22.6325 45.6884 0.7303 1.4091 3.5741 2.1319 2.2701 9.1464 0.3889 3.0219 0.4277 2.6131 2.0329 101.7668 5.3768 2.5378 12.9346 15.9189 7.2578 27.5601 16.1438 10.3666 34.9822 256.4295 7.5740 6.2507 13.2342 51.6870 32.6193 48.6442 51.6242 19.8445 82.2658 11.0755 154.1080 22.3110 22.7202 15.6253 18.2825 31.9184 34.2873 53.8009 11.1933 40.1938 41.1544 29.5911 26.1447 53.2215 45.9241 9.7332 27.4723 47.6120 17.7641 8.5612 4.1339 11.4494 9.1882 3.3192 3.4774 7.7961
temp: 298.150 k
press: 1.00000 atm
elementType: 8 8 8 8 7 6 6 6 6 6 6 6 6 6 6 6 6 6 6 6 6 6 6 6 6 6 6 6 6 1 1 1 1 1 1 1 1 1 1 1 1 1 1 1 1 1 1 1 1 1 1 1 1 1
symmnumber: 1
zpe: 1147571.6 jmol-1
zpe.correction: 0.437087 hartree
zpe.thermalcorrener: 0.460923 hartree
zpe.thermalcorrenthalpy: 0.461868 hartree
zpe.thermalcorrgfe: 0.383062 hartree
zpe.sumelectzpe: -1283.017270 hartree
zpe.sumelectthermal: -1282.993433 hartree
zpe.sumelectthermalent: -1282.992489 hartree
zpe.sumelectthermalfe: -1283.071294 hartree
dipole: 3.6166 5.2626 1.9325
dipole: 6.6715
quadrupole: -222.9070 -162.3946 -168.1451
quadrupole: -23.6228 19.4545 0.7003
quadrupole: -38.4247 22.0876 16.3371 -23.6228 19.4545 0.7003
hfenergy: -1283.4543566 hartree
pointgroup: C01 [X(C24H25N1O4)]
dipole: 1.375885 1.9394211 1.1113513 debye
polarizability: 376.9408207|-12.2465745|245.2103321|-6.4027564|19.5986903|215.5287259 unknown
InChI: InChI=1S/C24H25NO4/c1-24-13-12-18-17-9-7-16(29-22-5-3-2-4-21(22)25(27)28)14-15(17)6-8-19(18)20(24)10-11-23(24)26/h2-5,7,9,14,18-20H,6,8,10-13H2,1H3
charge 0 multiplicity 1
54 atoms
O  6.416777 0.401661 -1.229213
O  -3.161644 -0.801857 -0.685981
O  -7.127408 -0.901049 0.432955
O  -5.607425 -1.875771 -0.961077
N  -6.026338 -0.884817 -0.254075
C  3.42406 0.626039 0.816008
C  4.046701 0.851115 -0.602346
C  3.170328 -0.874744 1.165955
C  2.524301 -1.686437 0.00651
C  3.516618 -0.076429 -1.719221
C  4.491803 1.243055 1.782941
C  3.396521 -1.544216 -1.267318
C  2.299332 -1.042385 2.436672
C  5.563594 0.672458 -0.349935
C  5.860988 0.89767 1.141293
C  3.862037 2.336321 -1.05162
C  1.034529 -1.351128 -0.181693
C  0.882036 -0.461451 2.240899
C  0.260513 -0.813934 0.891472
C  0.373255 -1.657144 -1.400401
C  -1.127635 -0.591681 0.714436
C  -1.006587 -1.436257 -1.582081
C  -1.7435 -0.893255 -0.513892
C  -3.831105 0.396235 -0.444157
C  -5.241772 0.368936 -0.230427
C  -3.170011 1.652074 -0.421037
C  -5.956617 1.563819 0.02177
C  -3.892334 2.838214 -0.193231
C  -5.29007 2.800834 0.035043
H  2.468049 1.177917 0.881773
H  4.156831 -1.346996 1.362596
H  2.565387 -2.754908 0.315018
H  4.204781 -0.00252 -2.582885
H  2.526614 0.29226 -2.052372
H  4.400892 0.846035 2.808656
H  4.364909 2.33851 1.850596
H  3.007956 -2.164425 -2.095806
H  4.40464 -1.944159 -1.038727
H  2.774143 -0.565995 3.31529
H  2.22464 -2.124323 2.664045
H  6.292323 -0.037058 1.548755
H  6.635089 1.675505 1.267778
H  2.783935 2.555901 -1.16207
H  4.286147 3.057756 -0.330312
H  4.353586 2.501939 -2.027064
H  0.914176 0.6432 2.340073
H  0.218737 -0.812233 3.054794
H  0.942648 -2.086647 -2.230714
H  -1.727707 -0.202671 1.545696
H  -1.514746 -1.689565 -2.516602
H  -2.090325 1.685627 -0.592122
H  -7.032188 1.488333 0.203069
H  -3.361888 3.796425 -0.196852
H  -5.849072 3.723521 0.215537
