program: Gaussian 09
title: 000266421
version: EM64L-G09RevD.01
frameworkgroup: C1[X(C14H12N2O)]
method: RPBEPBE
basis: SDD
operation: Freq
keyword: #p
keyword: freq=noraman
keyword: PBEPBE/SDD
title: #p freq=noraman PBEPBE/SDD
converged: NO YES NO NO
title: Mulliken charges:
elementType: O N N C C C C C C C C C C C C C C H H H H H H H H H H H H
charge: -0.249231 -0.289528 0.069769 0.073208 0.073554 0.150772 0.189855 0.374738 0.404861 -0.456191 -0.414451 -0.347161 -0.339577 -0.850340 -0.799799 -0.265294 -0.212628 0.231054 0.232001 0.247001 0.300000 0.235115 0.237235 0.235065 0.245982 0.215727 0.245994 0.229320 0.232947
chargesum: 0.00000
title: Mulliken charges with hydrogens summed into heavy atoms:
elementType: O N N C C C C C C C C C C C C C C
charge: -0.249231 -0.289528 0.069769 0.073208 0.073554 0.150772 0.189855 0.374738 0.404861 -0.225138 -0.182450 -0.100160 -0.039577 -0.142925 -0.092096 -0.035974 0.020319
polarizability: 2.48937070e+02 1.87216209e+00 2.18946158e+02 -5.33889445e-03 -1.20700286e-02 7.33853192e+01
1716.lowfreq: -0.0010 -0.0006 -0.0006 4.0971 5.6392 5.8239 58.4863 111.9822 118.0215
frequency: 58.4749 111.9638 118.0211 127.6594 189.2753 192.0793 196.8588 213.1927 231.0314 281.3812 315.7114 321.0594 327.4551 375.7321 383.6521 423.0398 440.5974 481.2074 523.0510 554.0603 568.9924 577.9684 605.9617 647.8467 714.2541 741.5602 741.6455 765.9583 788.1849 789.7009 819.0500 883.2730 887.6196 949.5335 957.9259 967.5570 983.2345 992.6358 1013.3263 1028.3813 1042.7498 1044.3888 1067.9669 1105.4629 1136.5913 1170.7121 1189.0157 1203.0527 1245.4788 1264.6807 1272.1982 1298.3646 1339.5681 1370.6754 1389.5716 1400.4450 1407.4257 1415.1481 1436.9842 1462.1186 1464.5337 1468.3825 1471.2301 1482.3505 1511.1246 1588.8412 1591.0413 1609.7012 1621.2620 2972.6869 2990.2882 3049.4148 3072.2081 3086.6224 3092.8501 3124.2332 3136.5094 3147.7324 3157.4151 3179.3108 3218.2078
redmass: 4.8672 3.0568 5.5294 3.0389 1.2289 4.1889 1.2076 9.3126 2.9085 2.8342 4.5384 4.1631 3.8260 5.1534 7.0272 5.3574 3.2122 5.0393 4.9565 3.7887 5.1929 3.4765 4.3802 6.5468 6.4992 3.4895 6.8759 1.6750 5.7411 3.3273 1.2357 1.4003 5.1691 1.3353 1.3914 2.6247 3.0997 1.3169 1.7302 1.9132 1.5491 1.5410 3.9102 1.9493 1.7042 1.2055 2.6679 2.5472 2.3711 2.4971 2.6420 2.0967 4.5275 3.7064 4.0971 1.3507 1.6335 2.3059 3.0741 1.0450 1.3529 1.8838 1.0461 1.1842 3.5244 7.5179 6.7475 7.5886 8.1326 1.0379 1.0365 1.0976 1.0964 1.0979 1.1008 1.0872 1.0867 1.0963 1.0936 1.0957 1.0951
irintensity: 1.8582 0.9045 0.0592 1.6461 0.0367 1.0560 2.1364 3.1528 0.0005 1.0452 1.8275 0.5222 0.1919 0.3171 1.2675 1.1048 3.3389 0.6439 2.8382 9.5357 11.4499 2.2884 0.7317 1.5432 12.9964 15.4048 14.7195 59.7643 3.8874 20.0029 30.5258 1.2951 12.7180 0.0465 3.8216 46.2137 64.5897 0.6355 15.1299 10.1162 0.1466 13.9265 58.6800 40.4142 28.9468 11.0950 0.7816 54.1730 14.4996 8.5231 14.0790 6.1879 169.4899 0.7801 6.4331 10.1789 19.7590 4.1089 38.2648 13.5094 9.6757 1.7670 15.9101 29.9598 17.2756 0.8423 1.5433 7.1378 3.0354 26.4696 21.8293 17.2777 10.9355 23.7026 30.6492 9.5129 3.8051 30.6963 21.6595 15.6892 2.5401
temp: 298.150 k
press: 1.00000 atm
elementType: 8 7 7 6 6 6 6 6 6 6 6 6 6 6 6 6 6 1 1 1 1 1 1 1 1 1 1 1 1
symmnumber: 1
zpe: 589691.1 jmol-1
zpe.correction: 0.224601 hartree
zpe.thermalcorrener: 0.238593 hartree
zpe.thermalcorrenthalpy: 0.239537 hartree
zpe.thermalcorrgfe: 0.184686 hartree
zpe.sumelectzpe: -724.201365 hartree
zpe.sumelectthermal: -724.187373 hartree
zpe.sumelectthermalent: -724.186429 hartree
zpe.sumelectthermalfe: -724.241280 hartree
dipole: -0.7810 -3.9002 -0.0011
dipole: 3.9776
quadrupole: -84.4005 -99.7072 -102.8603
quadrupole: -4.5389 -0.0013 -0.0063
quadrupole: 11.2555 -4.0512 -7.2043 -4.5389 -0.0013 -0.0063
hfenergy: -724.4259662 hartree
pointgroup: C01 [X(C14H12N2O1)]
dipole: 0.3923283 -1.5145655 0.0338982 debye
polarizability: 249.0475463|-0.1724142|218.7689158|0.9152663|-3.0031398|73.4520847 unknown
InChI: InChI=1S/C14H12N2O/c1-9-7-8-10(2)14-13(9)11-5-3-4-6-12(11)16(14)15-17/h3-8H,1-2H3
charge 0 multiplicity 1
29 atoms
O  -1.384761 3.274912 -0.084882
N  -0.260514 1.316123 -0.037989
N  -0.227083 2.725272 -0.0675
C  0.594607 -0.836313 0.010631
C  0.954697 0.549357 -0.01599
C  -0.873985 -0.913322 0.004571
C  -1.384551 0.427602 -0.025397
C  1.599121 -1.83855 0.036883
C  2.292994 1.009418 -0.01828
C  2.942759 -1.39132 0.034785
C  3.274279 -0.015937 0.008111
C  -1.78925 -1.99012 0.021866
C  -2.764011 0.717927 -0.038069
C  1.273193 -3.318636 0.06648
C  2.703918 2.466651 -0.046103
C  -3.176476 -1.714547 0.009393
C  -3.655169 -0.381457 -0.020044
H  3.748906 -2.13384 0.054527
H  4.330179 0.278528 0.007683
H  -1.441773 -3.025804 0.044506
H  -3.125385 1.745102 -0.060755
H  0.689393 -3.624312 -0.8225
H  2.194896 -3.923985 0.086367
H  0.676256 -3.585374 0.959235
H  2.30139 3.020424 0.820492
H  3.803718 2.553263 -0.041648
H  2.311401 2.983873 -0.939466
H  -3.890993 -2.544697 0.022717
H  -4.734154 -0.193438 -0.029124
