program: Gaussian 09
title: 000266391
version: EM64L-G09RevD.01
frameworkgroup: C1[X(C30H24N2O2)]
method: RPBEPBE
basis: SDD
operation: Freq
keyword: #p
keyword: freq=noraman
keyword: PBEPBE/SDD
title: #p freq=noraman PBEPBE/SDD
converged: YES YES NO NO
title: Mulliken charges:
elementType: O O N N C C C C C C C C C C C C C C C C C C C C C C C C C C C C C C H H H H H H H H H H H H H H H H H H H H H H H H
charge: -0.180287 -0.167527 -0.289899 -0.307149 -0.341920 -0.341875 -0.249597 -0.278615 0.107123 0.120563 0.470770 0.486985 0.402010 0.502080 -0.362748 -0.332692 -0.435236 -0.412170 -0.342924 -0.347348 -0.241374 -0.252214 -0.226124 -0.240859 -0.350572 -0.325200 -0.244106 -0.243619 -0.240725 -0.246940 -0.266903 -0.222628 -0.233318 -0.242630 0.313414 0.302217 0.262045 0.248825 0.247285 0.254684 0.246956 0.236119 0.246059 0.248299 0.228018 0.231790 0.227185 0.228806 0.261102 0.276183 0.220593 0.220010 0.230311 0.230231 0.225239 0.230100 0.231017 0.231177
chargesum: 0.00000
title: Mulliken charges with hydrogens summed into heavy atoms:
elementType: O O N N C C C C C C C C C C C C C C C C C C C C C C C C C C C C C C
charge: -0.180287 -0.167527 -0.289899 -0.307149 -0.028506 -0.039658 0.012448 -0.029789 0.107123 0.120563 0.470770 0.486985 0.402010 0.502080 -0.115463 -0.078008 -0.188280 -0.176051 -0.096865 -0.099048 -0.013355 -0.020423 0.001061 -0.012053 -0.089470 -0.049017 -0.023513 -0.023609 -0.010414 -0.016709 -0.041665 0.007472 -0.002301 -0.011453
polarizability: 4.01214567e+02 -2.32477016e+01 3.25078949e+02 2.69384239e+00 3.02495871e+01 2.58928119e+02
1716.lowfreq: -8.0719 -5.8613 -1.5853 -0.0009 -0.0007 0.0005 14.9314 27.4199 32.4511
frequency: 14.9133 27.4016 32.4056 41.4054 44.4626 50.4422 58.1196 62.0744 72.8472 76.0038 89.4892 114.8317 138.0662 157.2325 161.8584 191.7966 204.4889 223.2094 241.2821 262.3366 270.1863 273.7138 291.1185 343.2892 351.0435 403.2750 403.6376 405.2575 409.9396 412.1931 441.2198 465.7918 494.3548 505.1767 513.8446 524.4851 566.0775 583.0774 598.5144 605.5217 614.4937 614.8045 615.2814 617.7223 635.9552 648.5529 680.9879 691.3746 694.3560 703.9540 705.8930 716.4935 731.9859 753.3449 753.8539 762.3896 765.9049 788.0662 817.1131 827.5237 841.6946 843.8926 857.5193 858.1767 864.0655 876.2681 893.9031 919.4929 925.8559 932.1327 957.2728 964.6333 974.2540 975.4448 978.0458 980.3976 982.3052 983.2198 988.5653 990.3223 991.0664 992.4530 995.6440 998.2127 1000.7136 1024.5110 1025.4841 1030.0779 1034.6572 1046.7648 1078.8579 1082.1464 1090.1005 1090.9454 1095.9247 1136.8299 1158.1520 1165.0183 1171.8385 1172.7558 1173.4174 1175.3446 1181.1638 1184.7414 1193.5251 1195.7870 1198.3461 1202.0097 1207.6220 1244.2187 1256.2514 1266.0908 1286.1626 1301.2257 1304.3069 1308.0792 1327.9747 1330.6979 1336.7971 1340.2861 1348.1550 1354.2104 1382.4855 1385.5963 1387.7175 1389.3205 1441.5384 1444.3425 1445.0313 1450.2091 1481.3510 1481.7591 1487.5014 1494.8540 1580.9445 1594.1822 1595.3400 1596.0830 1611.4851 1611.7520 1612.3803 1618.6481 1631.4308 1693.9730 2942.0078 2961.5532 3034.8542 3086.8926 3111.4101 3116.2112 3123.8886 3125.5084 3127.8124 3131.5602 3132.3610 3136.7736 3137.9163 3144.9733 3147.4499 3149.4790 3155.0523 3161.5808 3163.0877 3164.3394 3164.9333 3171.8954 3179.4948 3184.2710
redmass: 5.5667 5.7381 5.8916 3.9729 5.0755 3.8866 4.6562 4.3897 3.8829 6.6963 6.6618 6.6823 5.6454 5.6896 7.2388 4.9214 5.4466 4.8513 5.7829 4.8878 5.0374 5.4773 9.1073 5.7645 5.8015 2.8573 2.8186 2.8414 5.3679 2.9693 5.6860 5.1715 4.1594 2.9585 4.1702 3.6651 5.6091 6.7433 5.9584 7.9160 6.4113 6.3868 6.3891 6.2421 5.9752 5.5214 5.3069 1.9834 2.0168 2.0632 2.1460 2.6978 3.7779 1.8877 2.1530 2.4456 1.8667 3.0258 1.2759 4.4762 1.4691 2.8948 1.2655 1.2598 4.4726 1.4690 3.9797 1.4438 1.4975 1.5149 1.4223 3.7568 1.4415 2.9436 1.4468 1.5084 1.6759 3.1324 3.4105 5.0096 5.3694 3.9613 1.4295 1.3418 1.3391 2.2828 2.1920 2.1420 2.0882 2.9878 1.6814 1.5947 1.6278 1.6676 1.8926 4.3905 3.1591 3.9212 1.0737 1.0625 1.0776 1.0566 1.1960 1.2121 2.1740 1.1594 2.0693 1.4561 1.4636 1.2880 1.7100 1.4193 1.3513 1.4615 1.5417 1.4724 4.0344 1.4089 1.8028 1.9639 1.5252 1.5594 6.4772 9.2980 5.0127 4.0835 2.1469 2.1240 2.3064 2.5513 2.2628 2.2352 2.3179 2.4733 6.1032 6.0384 6.2213 6.3276 5.9682 6.0677 6.1035 6.0041 12.1240 12.4507 1.0844 1.0842 1.0841 1.0872 1.0882 1.0876 1.0846 1.0856 1.0861 1.0892 1.0854 1.0907 1.0909 1.0904 1.0957 1.0958 1.0928 1.0961 1.0941 1.1012 1.1012 1.0990 1.0953 1.0981
irintensity: 0.1796 0.2814 0.3826 0.1490 0.3810 0.0271 0.1330 0.1389 0.0163 1.1447 1.1480 3.0479 0.6132 2.1484 2.4268 0.5723 1.4043 1.7005 1.4945 0.3076 1.4838 0.7575 9.7802 6.5310 0.9084 0.1891 0.1736 0.0783 0.8880 0.1965 6.0812 4.7494 17.2620 10.7634 16.3100 1.7778 7.2003 4.4874 10.9900 8.8654 0.2545 0.6989 0.6689 4.3647 6.0933 13.0066 0.8061 29.0917 47.0991 40.7788 19.7104 65.1723 0.9573 78.5477 59.8021 2.8286 14.9296 58.7732 0.2374 6.8313 3.2252 14.1995 0.6277 0.2020 7.6387 10.4693 4.6487 3.1348 0.6833 11.2052 0.0027 9.2316 0.9168 1.5489 2.0944 1.0284 2.0921 6.6656 6.0043 1.0176 1.0090 3.1148 1.1286 0.7600 0.4013 16.4933 0.7373 4.3724 15.1936 18.9605 18.8260 0.6399 5.7253 11.6453 2.4361 116.4325 47.5781 78.1837 1.7104 1.5146 4.0485 0.3607 9.3899 9.7453 9.4695 0.1639 12.1071 13.4352 14.3567 41.2421 27.7488 3.8279 7.9295 18.3500 14.0163 9.7756 312.7071 31.9180 15.3698 45.1049 24.0302 38.2351 4.9888 0.9843 3.1268 10.2209 18.3583 21.5694 9.2303 2.0134 7.0931 27.3403 80.3517 149.3093 6.3778 3.5146 13.3753 2.1238 11.2552 8.6075 13.0189 138.6537 363.5403 10.4409 28.1767 8.0007 7.2740 8.8231 6.7867 4.8591 5.4246 1.4501 0.2705 12.4393 0.0560 10.9487 9.3302 14.6249 34.0707 26.8653 42.4096 34.1781 31.6591 26.9821 15.7445 3.6155 4.8930 2.4062
temp: 298.150 k
press: 1.00000 atm
elementType: 8 8 7 7 6 6 6 6 6 6 6 6 6 6 6 6 6 6 6 6 6 6 6 6 6 6 6 6 6 6 6 6 6 6 1 1 1 1 1 1 1 1 1 1 1 1 1 1 1 1 1 1 1 1 1 1 1 1
symmnumber: 1
zpe: 1204195.1 jmol-1
zpe.correction: 0.458654 hartree
zpe.thermalcorrener: 0.485753 hartree
zpe.thermalcorrenthalpy: 0.486698 hartree
zpe.thermalcorrgfe: 0.398780 hartree
zpe.sumelectzpe: -1415.237059 hartree
zpe.sumelectthermal: -1415.209959 hartree
zpe.sumelectthermalent: -1415.209015 hartree
zpe.sumelectthermalfe: -1415.296933 hartree
dipole: 0.2305 -0.5310 0.7378
dipole: 0.9377
quadrupole: -182.5969 -183.4629 -200.0596
quadrupole: -11.7492 9.2688 5.1073
quadrupole: 6.1096 5.2436 -11.3531 -11.7492 9.2688 5.1073
hfenergy: -1415.6957129 hartree
pointgroup: C01 [X(C30H24N2O2)]
dipole: -0.0834427 -0.227115 -0.2785146 debye
polarizability: 398.9664135|26.510839|324.1780162|1.5439757|-33.6025217|262.0772058 unknown
InChI: InChI=1S/C30H24N2O2/c33-29-25-26(30(34)32(29)24-19-11-4-12-20-24)28(22-15-7-2-8-16-22)31(23-17-9-3-10-18-23)27(25)21-13-5-1-6-14-21/h1-20,25-28H
charge 0 multiplicity 1
58 atoms
O  1.182343 -1.824292 1.880977
O  2.37558 -0.476144 -2.47374
N  -1.472878 0.362793 -0.041624
N  2.144933 -1.128036 -0.190024
C  -0.192216 -1.625045 -0.189346
C  0.132123 -0.771502 -1.431855
C  -1.462057 -1.026622 0.461979
C  -0.511456 0.64567 -1.130658
C  1.079925 -1.541416 0.665853
C  1.660827 -0.75572 -1.487758
C  -2.70542 -1.854554 0.093053
C  0.516416 1.739728 -0.7896
C  -2.411908 1.315434 0.40421
C  3.529252 -1.058277 0.208307
C  -3.509623 -1.53028 -1.024784
C  0.91206 1.994933 0.545157
C  -3.020157 -3.005047 0.858253
C  1.095118 2.498578 -1.836698
C  -3.308829 1.010125 1.471899
C  -2.496971 2.607519 -0.19596
C  -4.606502 -2.347593 -1.378646
C  1.874377 2.988139 0.828703
C  -4.115801 -3.824318 0.506424
C  2.059496 3.4914 -1.556845
C  4.073765 -2.068448 1.036981
C  4.330163 0.024241 -0.228833
C  -4.243938 1.964211 1.919415
C  -3.441638 3.549523 0.260028
C  -4.911704 -3.498897 -0.616966
C  2.452577 3.739528 -0.220709
C  -4.32373 3.242864 1.321017
C  5.427601 -1.991523 1.426645
C  5.684642 0.083619 0.160244
C  6.238913 -0.919964 0.987939
H  -0.349563 -2.688488 -0.442416
H  -0.267858 -1.178067 -2.372822
H  -1.34087 -1.044698 1.56565
H  -1.047503 0.969369 -2.048779
H  -3.293533 -0.623376 -1.600686
H  0.446375 1.432868 1.362605
H  -2.407747 -3.258305 1.733784
H  0.79903 2.305044 -2.875409
H  -3.289497 0.025417 1.946644
H  -1.815864 2.88938 -1.003491
H  -5.227343 -2.08191 -2.241676
H  2.168444 3.17835 1.8666
H  -4.351321 -4.709574 1.107884
H  2.499813 4.070432 -2.376154
H  3.445674 -2.893075 1.383119
H  3.901806 0.80486 -0.862581
H  -4.919374 1.700255 2.741454
H  -3.481325 4.534948 -0.218662
H  -5.764635 -4.130446 -0.889297
H  3.195343 4.514173 0.000364
H  -5.053435 3.979799 1.672079
H  5.847111 -2.771412 2.071183
H  6.30466 0.91936 -0.181348
H  7.290633 -0.866633 1.289518
