program: Gaussian 09
title: 000266388
version: EM64L-G09RevD.01
frameworkgroup: C1[X(C14H13N)]
method: RPBEPBE
basis: SDD
operation: Freq
keyword: #pfreq=noraman
keyword: PBEPBE/SDD
title: #p freq=noraman PBEPBE/SDD
converged: YES YES NO NO
title: Mulliken charges:
elementType: N C C C C C C C C C C C C C C H H H H H H H H H H H H H
charge: -0.375508 -0.333370 -0.388357 0.484625 0.583782 -0.377988 -0.424611 -0.415990 -0.400514 -0.232495 -0.230273 -0.233966 -0.252235 -0.242707 -0.242498 0.238557 0.251994 0.268880 0.277141 0.234801 0.229816 0.221311 0.223769 0.228180 0.223712 0.226169 0.226684 0.231090
chargesum: 0.00000
title: Mulliken charges with hydrogens summed into heavy atoms:
elementType: N C C C C C C C C C C C C C C
charge: -0.106628 -0.094813 -0.136363 0.484625 0.583782 -0.100847 -0.189810 -0.186173 -0.179203 -0.008726 -0.002093 -0.010254 -0.026066 -0.016022 -0.011408
polarizability: 2.36054151e+02 -9.58268625e+00 1.20028375e+02 6.54599201e+00 -8.11837991e+00 1.16447636e+02
1716.lowfreq: -2.7874 -0.0007 0.0004 0.0005 5.8959 9.7389 36.8276 46.1401 59.6755
frequency: 36.5037 46.1360 59.6714 94.1561 164.4088 201.1603 226.6305 337.5595 363.1517 403.8468 406.0762 411.9557 503.7537 513.9160 587.4630 603.1213 615.1570 615.5806 701.9157 704.3665 716.9394 752.2427 767.8106 796.6090 811.5664 842.0856 857.4537 866.2614 909.2089 929.0147 968.1782 981.2370 987.7044 988.8093 993.1832 996.5737 999.1297 1022.0349 1027.5196 1066.9571 1078.4675 1082.0772 1102.0375 1114.8840 1170.3787 1172.9867 1181.6311 1188.0521 1192.6377 1231.5480 1256.9100 1305.3666 1321.3683 1347.6902 1379.6985 1389.8456 1407.1965 1441.6029 1450.1695 1486.1791 1487.8804 1590.2926 1592.0587 1614.2894 1616.1952 3075.3728 3103.3512 3112.4242 3115.1726 3121.3911 3125.3321 3133.7429 3138.2044 3145.5230 3150.6642 3162.9999 3164.7225 3345.3603
redmass: 3.7320 4.6155 4.5196 4.0575 4.7758 3.7787 4.6565 3.9342 4.4052 2.8186 2.8826 5.6897 3.3524 3.2279 3.8984 4.9595 6.4234 6.4241 1.7093 2.6298 2.1802 2.4817 2.2261 3.4241 2.6250 1.2627 1.4333 3.7915 1.4216 1.4515 1.3844 1.3930 5.5888 5.5081 1.3179 1.3082 1.3136 2.4125 2.1231 1.4753 1.6554 1.6226 1.1739 1.5697 1.0672 1.0644 1.2619 1.4299 1.1860 2.0195 1.6567 1.5509 1.3957 1.3712 5.8439 4.9908 2.2101 2.1678 2.1157 2.4266 2.4564 5.9071 6.1353 6.0237 6.0888 1.0877 1.0878 1.0900 1.0865 1.0868 1.0869 1.0899 1.0920 1.0955 1.0953 1.1012 1.1013 1.0765
irintensity: 0.0098 0.3405 0.0791 0.3271 1.2766 3.0435 1.0708 2.2663 0.3623 0.0651 0.0187 2.5864 7.0355 11.6715 26.3293 8.6941 0.3707 0.3445 68.8569 8.1791 153.2204 19.3772 12.0608 6.0875 11.5179 0.1194 0.2742 2.6352 0.1083 2.6864 0.1168 0.6215 0.2208 0.1210 0.3512 9.5675 0.6834 4.5974 18.1078 6.8026 16.3471 10.4832 12.8822 19.0050 0.2894 0.1537 0.8633 8.5695 6.5552 1.8018 6.7624 3.4322 3.5291 0.5769 0.2724 0.2489 5.1692 11.7350 10.3778 48.4741 6.9821 1.6036 1.0988 25.7094 18.2746 15.1088 16.3881 9.2243 9.5537 9.2090 1.1137 4.8418 26.4102 38.9840 22.8257 32.0667 23.7576 4.9072
temp: 298.150 k
press: 1.00000 atm
elementType: 7 6 6 6 6 6 6 6 6 6 6 6 6 6 6 1 1 1 1 1 1 1 1 1 1 1 1 1
symmnumber: 1
zpe: 597969.9 jmol-1
zpe.correction: 0.227755 hartree
zpe.thermalcorrener: 0.239878 hartree
zpe.thermalcorrenthalpy: 0.240822 hartree
zpe.thermalcorrgfe: 0.187878 hartree
zpe.sumelectzpe: -594.952526 hartree
zpe.sumelectthermal: -594.940403 hartree
zpe.sumelectthermalent: -594.939458 hartree
zpe.sumelectthermalfe: -594.992402 hartree
dipole: -1.4326 1.2891 -0.0267
dipole: 1.9274
quadrupole: -78.6485 -89.2849 -83.7084
quadrupole: -0.7481 3.4661 -3.9921
quadrupole: 5.2321 -5.4043 0.1722 -0.7481 3.4661 -3.9921
hfenergy: -595.1802804 hartree
pointgroup: C01 [X(C14H13N1)]
dipole: 0.5624539 0.4911095 -0.1321603 debye
polarizability: 236.0455141|11.2040178|124.1025213|3.1992509|5.8908252|112.382127 unknown
InChI: InChI=1S/C14H13N/c1-3-7-11(8-4-1)13-14(15-13)12-9-5-2-6-10-12/h1-10,13-15H
charge 0 multiplicity 1
28 atoms
N  -0.050642 -1.137083 1.526296
C  -0.5344 0.117441 0.83123
C  0.525283 -0.782484 0.165313
C  -1.953947 0.146374 0.358107
C  1.939186 -0.325401 -0.008134
C  -2.742969 -1.03212 0.339901
C  2.662434 -0.72553 -1.162566
C  -2.516736 1.362472 -0.10885
C  2.598093 0.487435 0.954871
C  -4.070144 -0.993407 -0.139728
C  4.000398 -0.318845 -1.357266
C  -3.843928 1.399915 -0.590374
C  3.935422 0.893268 0.762643
C  -4.624974 0.22065 -0.609819
C  4.643757 0.492506 -0.394965
H  -0.143801 1.082605 1.186045
H  0.153449 -1.440556 -0.62922
H  0.626817 -0.924883 2.284614
H  -2.305246 -1.956792 0.731832
H  2.170203 -1.358425 -1.911125
H  -1.914487 2.279842 -0.096665
H  2.068726 0.815099 1.859946
H  -4.67519 -1.907409 -0.143162
H  4.541092 -0.637544 -2.255501
H  -4.269004 2.345168 -0.946897
H  4.427598 1.520838 1.514183
H  -5.655621 0.249233 -0.981201
H  5.682728 0.806642 -0.542708
