program: Gaussian 09
title: 000266387
version: EM64L-G09RevD.01
frameworkgroup: C1[X(C15H12N2O3)]
method: RPBEPBE
basis: SDD
operation: Freq
keyword: #p
keyword: freq=noraman
keyword: PBEPBE/SDD
title: #p freq=noraman PBEPBE/SDD
converged: YES YES NO NO
title: Mulliken charges:
elementType: O O O N N C C C C C C C C C C C C C C C H H H H H H H H H H H H
charge: -0.229594 -0.199649 -0.197686 -0.359695 0.028931 -0.346547 -0.335600 0.491142 0.122489 0.348261 -0.407791 -0.375789 -0.230313 -0.229653 -0.324657 -0.333903 -0.236507 -0.369927 -0.363171 0.382401 0.265892 0.264806 0.304462 0.234230 0.278965 0.253792 0.290182 0.229805 0.229677 0.232254 0.291132 0.292061
chargesum: 0.00000
title: Mulliken charges with hydrogens summed into heavy atoms:
elementType: O O O N N C C C C C C C C C C C C C C C
charge: -0.229594 -0.199649 -0.197686 -0.055233 0.028931 -0.080656 -0.070794 0.491142 0.122489 0.348261 -0.173561 -0.096824 -0.000508 0.000024 -0.070865 -0.043721 -0.004253 -0.078795 -0.071110 0.382401
polarizability: 3.05785440e+02 -1.83922990e+01 1.94083825e+02 -1.52346088e+01 6.07668223e+00 1.22803970e+02
1716.lowfreq: -11.9849 -6.0692 -4.6503 0.0004 0.0007 0.0010 18.8402 22.7913 34.7876
frequency: 18.7261 22.7572 34.7261 62.8575 64.7827 92.9317 104.8521 141.6918 189.8440 212.8005 255.3211 273.1616 278.3051 318.7178 402.4546 403.9694 406.4373 423.1115 460.9477 490.4413 511.7604 527.5592 582.3399 614.4143 622.7494 654.1833 677.1939 677.9996 704.4403 722.5970 764.3748 768.0324 785.2500 797.4435 825.0279 851.5784 858.6130 865.2944 888.5671 932.6592 984.3672 988.9832 992.0450 999.1219 1002.5384 1007.8845 1014.5554 1019.8398 1027.8974 1044.3547 1080.6627 1090.3179 1103.5364 1115.8201 1146.8321 1172.9399 1182.0853 1184.5515 1202.4657 1216.1199 1234.2355 1264.9413 1296.5844 1319.6076 1336.3468 1368.2970 1382.5971 1403.1838 1405.9738 1413.9040 1445.2070 1477.1709 1486.1544 1541.5639 1590.8767 1596.7135 1607.1558 1613.9242 3084.6363 3118.2666 3129.6301 3141.7811 3150.6140 3153.2111 3160.4125 3164.0633 3166.2302 3185.6463 3188.1818 3314.7117
redmass: 5.9903 5.9789 4.2675 6.8166 5.9443 8.7868 5.5834 5.7801 5.6958 6.8167 6.2089 7.1668 5.1943 5.1784 4.2941 3.0966 3.0026 6.2011 4.4184 8.3692 4.3073 4.3799 5.0260 6.4637 7.1009 5.9034 5.4557 5.6731 2.0499 3.0391 3.1152 4.2339 3.8156 4.4783 3.6483 1.6426 1.2856 2.8119 1.7705 1.4334 1.4025 5.7800 1.3893 2.9320 1.4219 1.8636 1.5028 1.4985 2.0937 1.3432 1.5755 3.2508 1.5358 1.4350 1.3591 1.0591 1.3162 1.1420 2.2077 5.3333 1.7817 1.7019 1.3434 1.3702 1.6931 6.7095 6.5741 10.9939 2.4125 3.1625 2.1505 2.3748 2.5241 9.7479 6.1088 7.8171 6.3475 6.0450 1.0884 1.0875 1.0867 1.0917 1.0911 1.0956 1.0894 1.0899 1.1014 1.0952 1.0965 1.0743
irintensity: 0.0627 0.1438 0.0760 0.4654 1.1180 5.0822 0.8637 2.7549 3.9083 3.4146 1.6037 2.7397 10.1863 8.7332 4.1137 1.1721 0.2578 4.1848 4.9056 3.3761 6.3529 6.0070 13.0736 0.0318 0.3021 24.1317 53.4128 17.7702 21.4540 148.1382 44.5321 4.6725 47.2496 6.2830 8.3583 9.5850 1.2398 4.2014 58.9672 2.5685 0.4249 1.3157 3.0927 40.9423 4.5457 13.5280 8.4606 15.4423 42.1434 35.9879 16.8927 13.5811 31.7679 5.5539 34.7836 0.4832 22.0296 15.3737 20.0457 400.8453 11.6511 151.6637 29.2458 2.1912 121.9162 73.4389 17.9774 2.3689 29.0728 162.0462 21.4614 10.0978 1.9009 132.2491 1.2910 6.0791 1.5305 0.2765 7.1997 7.2823 0.7363 17.1414 6.1547 19.0155 5.5273 1.5011 30.1489 0.5559 1.5553 8.8392
temp: 298.150 k
press: 1.00000 atm
elementType: 8 8 8 7 7 6 6 6 6 6 6 6 6 6 6 6 6 6 6 6 1 1 1 1 1 1 1 1 1 1 1 1
symmnumber: 1
zpe: 625704.7 jmol-1
zpe.correction: 0.238318 hartree
zpe.thermalcorrener: 0.255026 hartree
zpe.thermalcorrenthalpy: 0.255970 hartree
zpe.thermalcorrgfe: 0.190546 hartree
zpe.sumelectzpe: -912.447981 hartree
zpe.sumelectthermal: -912.431273 hartree
zpe.sumelectthermalent: -912.430329 hartree
zpe.sumelectthermalfe: -912.495753 hartree
dipole: 3.7549 -0.5383 0.2947
dipole: 3.8047
quadrupole: -140.3195 -120.8507 -111.6926
quadrupole: -19.9220 1.1771 -0.1530
quadrupole: -16.0319 3.4369 12.5950 -19.9220 1.1771 -0.1530
hfenergy: -912.6862995 hartree
pointgroup: C01 [X(C15H12N2O3)]
dipole: -1.4635024 -0.2525726 -0.1870911 debye
polarizability: 307.6331345|16.7587163|184.9030406|-3.1509889|-23.7083615|130.1370603 unknown
InChI: InChI=1S/C15H12N2O3/c18-15(11-6-8-12(9-7-11)17(19)20)14-13(16-14)10-4-2-1-3-5-10/h1-9,13-14,16H
charge 0 multiplicity 1
32 atoms
O  0.213151 2.64109 -1.313194
O  4.94298 -2.219786 1.575088
O  6.148578 -0.611051 0.496338
N  -2.311976 2.263865 -0.068667
N  5.0354 -1.125014 0.897923
C  -2.311715 0.992259 -0.857027
C  -1.155014 1.323436 0.143825
C  -3.318297 -0.061136 -0.527353
C  0.160536 1.691813 -0.464094
C  1.40166 0.940445 -0.07624
C  -3.442642 -1.197239 -1.368695
C  -4.138871 0.045269 0.625095
C  -4.371195 -2.215417 -1.060739
C  -5.067571 -0.972517 0.930089
C  1.358839 -0.272188 0.664492
C  2.656274 1.460471 -0.497038
C  -5.184375 -2.107127 0.091581
C  2.546893 -0.956491 0.983123
C  3.85188 0.793181 -0.181523
C  3.776007 -0.408549 0.557834
H  -2.008469 1.056345 -1.91223
H  -1.168102 0.797536 1.101604
H  -1.988997 3.059637 -0.658933
H  -2.815341 -1.282201 -2.265004
H  -4.052835 0.943083 1.246838
H  0.40163 -0.698955 0.978643
H  2.663038 2.389485 -1.075311
H  -4.463608 -3.087772 -1.717141
H  -5.705434 -0.880718 1.816294
H  -5.906859 -2.895606 0.329943
H  2.542102 -1.892986 1.54646
H  4.828334 1.174835 -0.490283
