program: Gaussian 09
title: 000266380
version: EM64L-G09RevD.01
frameworkgroup: C1[X(C22H16Cl2N6)]
method: RPBEPBE
basis: SDD
operation: Freq
keyword: #p
keyword: freq=noraman
keyword: PBEPBE/SDD
title: #p freq=noraman PBEPBE/SDD
converged: YES YES NO NO
title: Mulliken charges:
elementType: Cl Cl N N N N N N C C C C C C C C C C C C C C C C C C C C C C H H H H H H H H H H H H H H H H
charge: -0.053367 -0.053364 -0.384121 -0.384123 -0.152282 -0.152283 0.012867 0.012868 0.172148 0.172150 0.101111 0.101112 -0.313148 -0.313154 -0.249688 -0.249691 0.477492 0.477492 -0.405323 -0.405323 -0.373847 -0.373843 -0.351762 -0.351767 -0.211577 -0.211577 -0.207029 -0.207028 -0.103547 -0.103549 0.296534 0.296535 0.233407 0.233408 0.305223 0.305223 0.212991 0.212988 0.230183 0.230183 0.251396 0.251399 0.257111 0.257113 0.255230 0.255230
chargesum: 0.00000
title: Mulliken charges with hydrogens summed into heavy atoms:
elementType: Cl Cl N N N N N N C C C C C C C C C C C C C C C C C C C C C C
charge: -0.053367 -0.053364 -0.078899 -0.078900 -0.152282 -0.152283 0.012867 0.012868 0.172148 0.172150 0.101111 0.101112 -0.016614 -0.016619 -0.016281 -0.016283 0.477492 0.477492 -0.192332 -0.192335 -0.143663 -0.143660 -0.100366 -0.100368 0.045534 0.045536 0.048201 0.048202 -0.103547 -0.103549
polarizability: 1.01658052e+03 -7.35220360e-04 3.39924251e+02 1.57037621e-01 -3.26536998e-03 1.08640353e+02
1716.lowfreq: -1.0428 0.0009 0.0019 0.0021 0.7122 1.1342 8.2330 16.2353 19.3054
frequency: 8.2262 16.2352 19.3054 26.1550 32.5101 40.7960 55.5498 75.7829 112.2282 123.5362 127.9989 144.7227 145.8659 173.6741 196.9305 214.3851 235.0025 238.0400 253.6650 259.0590 266.5870 317.1152 348.9417 350.2662 350.6606 377.0040 380.0915 406.7437 410.7584 410.8921 421.8354 456.3710 463.7348 488.0230 495.5205 508.8000 508.8811 542.3195 616.1604 618.2279 619.2386 631.5765 636.9320 653.0574 674.6471 680.0648 713.0482 713.9188 713.9964 729.4647 733.7476 779.4711 782.6330 789.0555 790.9465 821.7000 821.7242 833.6804 833.9594 864.2383 887.8499 910.2767 912.7902 913.0940 956.5571 956.5947 970.1735 970.5225 995.7269 995.7531 1001.1430 1016.8493 1028.8827 1065.5220 1070.0696 1071.0376 1072.1996 1098.4545 1106.1376 1113.5746 1141.8164 1168.6197 1175.6817 1180.2685 1180.4103 1218.7502 1244.6902 1245.2618 1252.1426 1276.6994 1293.5111 1294.4500 1316.1403 1332.9550 1338.4584 1368.4790 1375.5754 1380.7529 1402.8035 1402.8153 1411.9883 1429.2007 1473.3604 1475.2869 1486.8857 1511.8248 1533.2003 1535.7847 1548.6973 1550.6496 1564.3518 1580.0509 1580.1089 1599.5225 1599.5440 1617.5452 2989.8477 2989.9460 3129.8633 3129.8703 3133.9998 3154.4960 3155.4843 3155.4964 3172.0151 3172.0305 3176.4676 3176.4914 3188.1502 3191.2924 3349.5350 3349.8318
redmass: 7.0125 4.9594 12.1312 3.8991 5.3604 8.2955 10.3180 6.3551 8.8111 4.5309 9.1503 6.8787 9.1542 4.2910 5.5827 5.7533 11.3183 3.5529 4.0537 6.6069 6.9510 5.2004 7.5967 5.1566 4.9114 8.9984 7.3491 8.5344 2.9348 2.9450 3.4561 4.6101 6.3495 7.8391 7.4826 2.7463 2.7459 7.1288 7.4310 3.4857 7.6159 7.8768 7.7326 4.0666 6.6619 6.9075 5.8455 3.2432 3.2378 1.3030 1.3252 7.8009 5.5168 6.3249 1.3410 1.3169 1.3195 1.4213 1.4125 4.2032 4.4252 1.4047 1.5022 1.4828 1.4067 1.4061 1.3653 1.3643 4.0112 4.0029 1.3535 1.3201 2.8617 4.4454 4.5267 2.7730 3.2344 3.0781 1.4668 1.5744 2.4255 2.9111 1.1623 1.1215 1.1249 2.6953 2.0086 2.6810 1.8421 3.5135 1.3276 1.3756 1.7784 2.0841 2.5502 5.0030 3.2360 3.6840 4.1537 4.1733 2.1075 2.9468 2.3792 2.2646 2.9623 6.8379 2.6814 2.1406 5.8546 7.1628 4.9594 6.2752 6.0828 6.1692 6.1769 6.1162 1.0867 1.0867 1.0898 1.0898 1.0873 1.0943 1.0878 1.0878 1.0953 1.0953 1.0972 1.0972 1.0937 1.0959 1.0732 1.0731
irintensity: 0.1147 0.0000 0.1102 0.9413 0.0000 0.0348 1.4718 0.0000 0.9532 0.0001 1.7226 8.4191 0.2132 7.8728 0.0000 5.9779 6.6297 0.0000 30.3802 20.5845 0.1321 5.6376 5.6678 0.0266 1.8673 0.0001 1.5699 23.1805 0.0037 0.0000 1.2115 0.0001 115.4516 8.4889 21.1937 52.1209 0.0032 2.4717 0.5703 5.9853 0.5225 9.6163 3.4017 0.0001 0.8013 17.5101 6.5133 0.0076 0.0016 0.0001 172.5932 59.7786 0.0001 14.1364 79.4938 0.1576 26.8796 0.0027 64.0279 9.6798 2.4328 0.0000 102.6545 0.0017 11.4190 0.0247 0.0179 0.0002 61.6505 13.2594 6.7469 0.0009 11.6504 15.7424 31.6382 143.5881 4.3636 2.0185 62.0340 6.5501 445.5733 156.9277 0.3130 3.2370 1.8956 0.0419 0.0402 6.0885 490.6063 17.8948 2.4735 11.1704 308.9063 33.8166 143.0956 1.9775 2.1044 1.8499 12.9532 7.6837 245.4661 8.9471 436.5499 36.2107 3.8139 274.2728 1.1911 1050.1185 285.6122 9.8960 0.1329 7.2337 37.3858 19.2865 47.1564 7.9820 6.4354 90.0386 3.5950 17.0742 15.2902 13.4943 7.5918 0.9263 12.7521 8.3864 3.2245 2.8583 17.7124 17.0756 1.8235 15.2599
temp: 298.150 k
press: 1.00000 atm
elementType: 17 17 7 7 7 7 7 7 6 6 6 6 6 6 6 6 6 6 6 6 6 6 6 6 6 6 6 6 6 6 1 1 1 1 1 1 1 1 1 1 1 1 1 1 1 1
symmnumber: 1
zpe: 878489.7 jmol-1
zpe.correction: 0.334599 hartree
zpe.thermalcorrener: 0.360228 hartree
zpe.thermalcorrenthalpy: 0.361173 hartree
zpe.thermalcorrgfe: 0.273720 hartree
zpe.sumelectzpe: -2094.437424 hartree
zpe.sumelectthermal: -2094.411795 hartree
zpe.sumelectthermalent: -2094.410851 hartree
zpe.sumelectthermalfe: -2094.498303 hartree
dipole: 0.0001 0.8854 0.0008
dipole: 0.8854
quadrupole: -201.8118 -177.4160 -196.5059
quadrupole: -0.0009 0.0869 0.0011
quadrupole: -9.9006 14.4953 -4.5947 -0.0009 0.0869 0.0011
hfenergy: -2094.7720232 hartree
pointgroup: C01 [X(C22H16Cl2N6)]
dipole: 0.0001586 -0.3483301 -0.0016733 debye
polarizability: 1013.975599|0.0311884|339.9207707|48.5627051|0.9013159|111.2487572 unknown
InChI: InChI=1S/C22H16Cl2N6/c23-17-9-5-15(6-10-17)13-25-27-21-19-3-1-2-4-20(19)22(30-29-21)28-26-14-16-7-11-18(24)12-8-16/h1-14,27-28H
charge 0 multiplicity 1
46 atoms
Cl -9.831317 2.639608 -0.522272
Cl 9.829826 2.641777 0.5416
N  -2.744449 -1.565584 -0.151701
N  2.745634 -1.564866 0.137779
N  -0.681389 -2.489618 -0.04643
N  0.683181 -2.489439 0.025704
N  -3.738856 -0.628396 -0.202505
N  3.739431 -0.627443 0.195791
C  -0.724792 -0.013227 -0.039053
C  0.724957 -0.013033 0.036691
C  -1.369517 -1.310731 -0.077878
C  1.370533 -1.310367 0.065922
C  -1.41932 1.235707 -0.070317
C  1.418683 1.236083 0.077097
C  -0.711284 2.442529 -0.029081
C  0.70987 2.44272 0.044676
C  -6.124819 -0.156411 -0.329663
C  6.12509 -0.15492 0.326701
C  -4.984684 -1.070985 -0.271206
C  4.985546 -1.069738 0.261087
C  -7.441526 -0.694796 -0.399832
C  7.442146 -0.693026 0.39237
C  -5.969995 1.261421 -0.319351
C  5.969356 1.262852 0.327833
C  -8.572353 0.145535 -0.458313
C  8.572447 0.147522 0.4575
C  -7.089728 2.111018 -0.377141
C  7.088561 2.112662 0.39237
C  -8.379524 1.540399 -0.446231
C  8.378724 1.542315 0.456728
H  -2.508441 1.21781 -0.126318
H  2.507815 1.218469 0.132971
H  -1.255973 3.392692 -0.053647
H  1.253942 3.39303 0.076201
H  -2.955508 -2.578694 -0.166798
H  2.957358 -2.577923 0.145222
H  -5.209811 -2.155627 -0.287171
H  5.21138 -2.154325 0.268638
H  -7.583837 -1.782185 -0.408396
H  7.585137 -1.780359 0.392188
H  -4.96324 1.686102 -0.265707
H  4.962326 1.687308 0.277707
H  -9.580781 -0.27415 -0.511886
H  9.581148 -0.271932 0.5076
H  -6.968849 3.198208 -0.369341
H  6.966997 3.199803 0.393361
