program: Gaussian 09
title: 000266368
version: EM64L-G09RevD.01
frameworkgroup: C1[X(C22H16Br2N6)]
method: RPBEPBE
basis: SDD
operation: Freq
keyword: #p
keyword: freq=noraman
keyword: PBEPBE/SDD
title: #p freq=noraman PBEPBE/SDD
converged: YES YES NO NO
title: Mulliken charges:
elementType: Br Br N N N N N N C C C C C C C C C C C C C C C C C C C C C C H H H H H H H H H H H H H H H H
charge: 0.014230 0.014226 -0.384032 -0.384050 -0.152158 -0.152172 0.012918 0.012932 0.172207 0.172264 0.101473 0.101488 -0.312775 -0.312854 -0.249574 -0.249530 0.473918 0.473909 -0.405460 -0.405456 -0.376828 -0.376829 -0.354742 -0.354748 -0.184151 -0.184161 -0.179078 -0.179067 -0.211353 -0.211353 0.296430 0.296404 0.233649 0.233650 0.305493 0.305494 0.212913 0.212914 0.231325 0.231325 0.252368 0.252382 0.252766 0.252766 0.250463 0.250463
chargesum: 0.00000
title: Mulliken charges with hydrogens summed into heavy atoms:
elementType: Br Br N N N N N N C C C C C C C C C C C C C C C C C C C C C C
charge: 0.014230 0.014226 -0.078540 -0.078555 -0.152158 -0.152172 0.012918 0.012932 0.172207 0.172264 0.101473 0.101488 -0.016345 -0.016451 -0.015925 -0.015880 0.473918 0.473909 -0.192547 -0.192542 -0.145504 -0.145504 -0.102373 -0.102366 0.068615 0.068605 0.071385 0.071396 -0.211353 -0.211353
polarizability: 1.07774637e+03 2.31933757e-03 3.56604069e+02 -1.55626366e-01 6.65860722e-02 1.10242739e+02
1716.lowfreq: -3.0014 -0.0007 0.0009 0.0010 1.2819 3.2364 7.8933 13.6594 15.4090
frequency: 7.8919 13.6594 15.4079 26.2909 30.9501 34.8147 49.9822 70.9909 99.7488 120.3919 123.2853 127.8945 135.3960 171.7538 190.3508 198.9341 210.0952 237.8426 238.0385 239.9728 254.0812 300.2518 309.7980 344.2353 344.7314 356.7542 360.8294 377.3770 408.7804 408.9387 421.7620 456.3956 457.6327 479.5465 490.7570 511.4331 511.5129 528.3964 612.5624 614.6524 618.2913 624.6498 635.1967 653.1045 666.5643 672.3444 708.3283 715.2498 715.3225 729.8076 734.1108 779.4613 782.5934 787.4807 790.9734 824.2971 824.3126 835.9818 836.2707 863.3599 887.3324 910.3301 913.7969 914.0382 960.8394 960.8849 974.7674 975.1324 991.5975 991.6770 1001.1115 1016.8896 1029.0023 1057.9853 1058.0125 1065.5551 1071.1729 1098.6756 1107.5727 1114.9661 1142.0687 1168.8352 1175.8217 1183.1277 1183.2254 1218.7527 1244.7652 1245.4597 1252.1752 1276.4735 1293.8302 1294.6943 1316.0200 1332.0931 1337.2707 1365.9729 1372.4944 1379.8549 1399.0214 1399.0363 1411.9298 1429.0819 1468.9689 1470.8545 1486.5243 1511.3843 1532.4755 1535.2488 1545.7132 1548.0733 1564.2671 1576.0489 1576.0577 1595.9032 1595.9458 1617.5891 2990.6670 2990.7684 3128.8570 3128.8723 3134.1987 3154.1546 3154.1757 3154.7085 3170.1396 3170.1624 3175.0584 3175.1024 3188.6859 3191.8137 3350.1485 3350.4410
redmass: 6.6166 17.5513 5.3651 3.8696 4.9436 8.9223 9.7152 6.3120 10.8277 4.3652 8.5484 10.1258 7.0942 4.5252 5.7286 14.3762 5.4880 5.8268 3.4457 6.0607 4.0127 10.0504 5.2250 5.0977 4.8715 7.9944 5.7591 9.0142 2.9143 2.9272 3.4540 4.6105 6.0745 7.6878 7.2558 2.7577 2.7573 7.0201 8.0883 7.3682 3.4836 7.2721 7.7353 4.0722 6.7895 7.0630 5.7436 3.2017 3.1896 1.3067 1.3280 7.8366 5.5112 6.3061 1.3404 1.3225 1.3248 1.4131 1.4044 4.2175 4.4488 1.3997 1.5140 1.4999 1.4012 1.4007 1.3685 1.3675 4.6831 4.6677 1.3536 1.3205 2.8681 2.6844 2.6078 4.4581 5.5552 3.2051 1.4998 1.5686 2.4037 2.9307 1.1628 1.1176 1.1163 2.6775 1.9821 2.6439 1.8435 3.5398 1.3217 1.3641 1.7767 2.1335 2.6508 4.4363 3.0616 3.8279 4.0323 4.0499 2.1061 2.9532 2.3437 2.2725 2.9166 6.9388 2.6802 2.1439 5.9968 7.2514 4.9686 6.0222 5.8354 6.0563 6.0602 6.1189 1.0867 1.0868 1.0897 1.0897 1.0873 1.0879 1.0879 1.0942 1.0953 1.0953 1.0973 1.0973 1.0936 1.0958 1.0732 1.0731
irintensity: 0.0854 0.0703 0.0000 0.9447 0.0000 0.0118 0.8543 0.0000 0.4112 0.0000 2.7133 0.2455 6.8436 7.2124 0.0000 7.3105 6.1337 23.3005 0.0027 1.2463 29.8852 5.7047 2.1232 0.0001 3.2864 11.7780 0.0931 0.0000 0.0161 0.0000 1.2209 0.0004 74.2346 6.4928 54.2065 55.7905 0.0040 0.2859 2.2049 0.2341 6.0458 6.2118 4.0199 0.0002 0.7880 10.4406 5.7970 0.1455 0.0000 0.0021 170.4214 61.0717 0.0001 18.0498 79.5737 1.5965 25.5318 0.0001 56.7268 12.7368 5.5859 0.0001 105.7188 0.0352 10.5004 0.0718 0.0132 0.0001 95.9603 21.1348 6.7973 0.0004 11.5263 27.5775 103.7648 17.8300 3.6693 1.2446 74.2297 4.6945 472.5214 181.1307 0.3703 3.4800 0.7335 0.2775 1.5804 6.8303 502.6425 18.5028 2.0587 7.4756 319.0390 34.6437 160.7228 1.6933 3.5524 2.3995 15.6487 10.3371 257.5948 7.9058 411.2113 38.7043 2.8171 319.1566 0.8129 1112.0721 267.6820 12.0729 0.1572 16.4425 60.4437 21.8452 55.6260 8.1044 8.0451 91.5483 6.2513 14.3718 15.5534 2.5507 5.0502 13.8353 11.2950 15.4058 2.1238 3.2165 18.9818 16.2935 2.3572 16.1777
temp: 298.150 k
press: 1.00000 atm
elementType: 35 35 7 7 7 7 7 7 6 6 6 6 6 6 6 6 6 6 6 6 6 6 6 6 6 6 6 6 6 6 1 1 1 1 1 1 1 1 1 1 1 1 1 1 1 1
symmnumber: 1
zpe: 875954.6 jmol-1
zpe.correction: 0.333633 hartree
zpe.thermalcorrener: 0.359733 hartree
zpe.thermalcorrenthalpy: 0.360677 hartree
zpe.thermalcorrgfe: 0.270595 hartree
zpe.sumelectzpe: -1201.235945 hartree
zpe.sumelectthermal: -1201.209845 hartree
zpe.sumelectthermalent: -1201.208901 hartree
zpe.sumelectthermalfe: -1201.298983 hartree
dipole: -0.0011 0.8594 0.0005
dipole: 0.8594
quadrupole: -205.2487 -181.3210 -202.3864
quadrupole: -0.0004 -0.0896 0.0203
quadrupole: -8.9300 14.9977 -6.0677 -0.0004 -0.0896 0.0203
hfenergy: -1201.5695786 hartree
pointgroup: C01 [X(C22H16Br2N6)]
dipole: -0.000268 -0.3381013 -0.0016639 debye
polarizability: 1076.4355656|0.1367766|356.5989991|35.5873852|1.1302299|111.558611 unknown
InChI: InChI=1S/C22H16Br2N6/c23-17-9-5-15(6-10-17)13-25-27-21-19-3-1-2-4-20(19)22(30-29-21)28-26-14-16-7-11-18(24)12-8-16/h1-14,27-28H
charge 0 multiplicity 1
46 atoms
Br -9.946841 2.734558 -0.353023
Br 9.945006 2.739567 0.372618
N  -2.745918 -1.569762 -0.11236
N  2.747479 -1.568263 0.096814
N  -0.681608 -2.493317 -0.038048
N  0.68403 -2.492907 0.014304
N  -3.741039 -0.632691 -0.142328
N  3.741879 -0.630732 0.135192
C  -0.725322 -0.016768 -0.027891
C  0.725385 -0.016319 0.027239
C  -1.370123 -1.314462 -0.05862
C  1.371437 -1.313649 0.045828
C  -1.420388 1.232074 -0.048343
C  1.419189 1.232986 0.059278
C  -0.712181 2.439023 -0.015933
C  0.709769 2.439478 0.038072
C  -6.127421 -0.158043 -0.229175
C  6.127925 -0.154971 0.224864
C  -4.988148 -1.074549 -0.192331
C  4.989372 -1.072032 0.180322
C  -7.445985 -0.692478 -0.282134
C  7.446986 -0.688786 0.271355
C  -5.970571 1.25907 -0.214031
C  5.969865 1.262091 0.223516
C  -8.5762 0.150418 -0.318838
C  8.576535 0.154673 0.315028
C  -7.089331 2.111404 -0.250237
C  7.087947 2.114976 0.266818
C  -8.384792 1.547298 -0.302464
C  8.383932 1.551483 0.312297
H  -2.510138 1.214034 -0.08912
H  2.50895 1.215653 0.099881
H  -1.257343 3.38908 -0.032192
H  1.253976 3.389889 0.063175
H  -2.957119 -2.582805 -0.126807
H  2.95953 -2.58122 0.101636
H  -5.214521 -2.158855 -0.209574
H  5.216646 -2.156265 0.186946
H  -7.591525 -1.779478 -0.294431
H  7.593434 -1.775731 0.273082
H  -4.962563 1.682402 -0.173611
H  4.961464 1.684928 0.188133
H  -9.583887 -0.272503 -0.359023
H  9.584617 -0.267752 0.350152
H  -6.960234 3.197512 -0.238487
H  6.957942 3.201038 0.265654
