program: Gaussian 09
title: 000266347
version: EM64L-G09RevD.01
frameworkgroup: C1[X(C11H16N6O5)]
method: RPBEPBE
basis: SDD
operation: Freq
keyword: #p
keyword: freq=noraman
keyword: PBEPBE/SDD
title: #p freq=noraman PBEPBE/SDD
converged: YES YES NO NO
title: Mulliken charges:
elementType: O O O O O N N N N N N C C C C C C C C C C C H H H H H H H H H H H H H H H H
charge: -0.306583 -0.470791 -0.452014 -0.499703 -0.227728 -0.289408 -0.052788 -0.432871 -0.385717 -0.058457 -0.624684 -0.113228 -0.127817 -0.220047 -0.089849 -0.348810 0.363774 0.176707 -0.129098 -0.004156 0.128231 -0.614423 0.288997 0.273484 0.268501 0.270927 0.240985 0.232074 0.378302 0.388864 0.347984 0.354476 0.384786 0.241360 0.258405 0.203017 0.300521 0.346777
chargesum: 0.00000
title: Mulliken charges with hydrogens summed into heavy atoms:
elementType: O O O O O N N N N N N C C C C C C C C C C C
charge: -0.306583 -0.092489 -0.063150 -0.114917 -0.227728 -0.289408 -0.052788 -0.084887 -0.031241 -0.058457 0.022615 0.175769 0.145667 0.048454 0.181078 0.124249 0.363774 0.176707 -0.129098 -0.004156 0.128231 0.088360
polarizability: 2.17518123e+02 -1.49775327e+01 2.04627315e+02 1.56831263e+01 1.41122641e+01 1.21666008e+02
1716.lowfreq: -12.4883 -5.0997 -0.0007 -0.0002 0.0003 4.0107 16.9565 27.7145 49.8934
frequency: 15.5451 27.5617 49.8754 64.4602 87.1011 103.4340 109.2458 135.3373 148.8858 153.1926 168.1844 203.5555 205.1279 221.1567 263.8303 266.5848 269.4478 285.1996 300.5612 310.4563 325.6683 338.7695 344.3864 365.8092 401.7993 413.6201 431.0163 446.4540 497.3472 526.4019 537.3808 546.7745 580.4114 602.4454 605.4439 613.5973 622.2499 634.9356 661.5731 683.1889 687.5167 702.8787 709.1679 759.8245 829.5941 835.4579 844.7825 877.1741 947.9923 958.3743 964.4957 967.0987 980.7116 1017.5364 1043.8462 1059.9854 1068.4527 1086.6602 1106.3967 1125.1119 1125.2627 1139.9017 1160.2539 1178.5304 1207.0511 1218.6263 1233.9210 1243.5664 1253.8298 1256.3488 1278.1755 1283.6993 1298.0100 1320.7671 1337.0325 1346.2223 1354.7566 1395.9812 1401.9884 1404.0490 1435.1617 1441.2302 1454.3226 1485.9304 1491.1858 1514.1852 1529.1934 1550.1025 1592.1135 1600.8202 1625.2607 1635.6987 2975.4807 2984.7060 3003.3121 3014.9832 3025.9768 3047.8267 3062.9493 3087.5149 3107.2170 3308.9431 3443.0979 3508.4393 3540.5914 3557.8275 3608.0333 3692.5439
redmass: 6.3652 5.8664 6.2642 4.6839 6.1771 2.5679 1.3728 4.6468 4.2174 3.6434 4.5388 7.2199 6.1302 6.2674 3.2548 1.2832 5.4719 2.9098 2.7589 2.5480 4.2459 3.2295 6.6017 5.5971 3.7685 1.7826 2.0145 4.6998 6.5423 1.1915 3.5623 6.9563 1.6308 2.5720 1.2965 1.3130 8.7170 3.1972 7.0206 4.3435 5.9017 5.8970 4.9593 11.3130 7.9127 3.0697 4.0017 5.0661 3.8916 3.9252 4.3567 6.1683 2.2764 2.9020 3.8635 4.2726 3.2144 3.5307 2.9036 2.1340 1.4500 2.1782 2.3823 1.2068 1.3016 1.2233 2.8978 1.5129 2.1480 2.0433 1.4178 1.2499 1.5591 2.0236 2.4248 1.3237 1.3926 1.3879 3.9144 1.4567 1.1986 1.2423 1.0538 1.0850 1.0882 3.2362 3.6198 1.6335 2.6255 2.8419 10.2764 3.0868 1.0388 1.0576 1.0841 1.0860 1.0865 1.1065 1.0948 1.0909 1.1023 1.0672 1.0812 1.0784 1.0453 1.0659 1.0672 1.1040
irintensity: 3.3677 6.1827 5.5907 0.4150 2.6043 4.9990 2.4769 3.8830 8.6893 1.5313 0.3667 5.7488 2.1446 16.1240 8.3244 84.1814 10.7311 31.2936 52.2587 10.7836 11.2152 47.0026 5.1618 7.8201 5.0856 35.9815 141.7708 16.6149 0.9955 217.3062 38.4372 10.2472 91.0955 35.9688 57.9723 184.3876 2.2380 48.3498 1.6487 14.0468 6.9413 5.1803 26.1776 5.5320 5.9053 2.0411 22.5620 14.5102 130.5510 122.5957 66.4696 15.8542 84.4062 14.1514 30.7509 13.1021 68.0662 27.6901 14.3544 12.8702 5.9722 13.2524 31.1414 0.3880 7.0021 15.6436 1.7899 31.5429 76.7429 41.1901 5.2257 49.6389 3.6918 92.3758 30.7178 3.7872 14.3031 31.0111 162.1979 2.2762 6.1042 68.6297 18.6875 7.6688 0.1966 179.8617 166.3090 69.9542 225.3408 578.8389 518.9439 175.6239 90.1663 30.6278 3.0585 7.3632 60.2967 17.1046 30.4079 29.6727 21.2808 246.0014 215.7206 127.0784 72.7439 31.0043 23.3673 38.2598
temp: 298.150 k
press: 1.00000 atm
elementType: 8 8 8 8 8 7 7 7 7 7 7 6 6 6 6 6 6 6 6 6 6 6 1 1 1 1 1 1 1 1 1 1 1 1 1 1 1 1
symmnumber: 1
zpe: 765034.0 jmol-1
zpe.correction: 0.291386 hartree
zpe.thermalcorrener: 0.312758 hartree
zpe.thermalcorrenthalpy: 0.313702 hartree
zpe.thermalcorrgfe: 0.240615 hartree
zpe.sumelectzpe: -1131.703676 hartree
zpe.sumelectthermal: -1131.682304 hartree
zpe.sumelectthermalent: -1131.681360 hartree
zpe.sumelectthermalfe: -1131.754447 hartree
dipole: -10.4383 -6.1292 -1.9161
dipole: 12.2554
quadrupole: -175.1830 -106.9310 -119.9203
quadrupole: -21.1793 -19.8859 -3.3142
quadrupole: -41.1716 27.0804 14.0912 -21.1793 -19.8859 -3.3142
hfenergy: -1131.9950619 hartree
pointgroup: C01 [X(C11H16N6O5)]
dipole: -4.7947493 0.1673986 0.480393 debye
polarizability: 205.0617209|16.573651|211.4679856|-11.2479127|27.8918691|127.2817391 unknown
InChI: InChI=1S/C11H16N6O5/c1-13-11-14-4-7(15-10(12)16-8(4)21)17(11)9-6(20)5(19)3(2-18)22-9/h3,5-6,9,13,15,18-20H,2,12H2,1H3
charge 0 multiplicity 1
38 atoms
O  -1.875568 0.525353 1.076082
O  -2.116154 -3.012339 0.485823
O  -4.304914 -1.311383 -1.061098
O  -3.753511 1.084965 -2.101924
O  4.360177 1.315623 -0.555108
N  0.16732 -0.565154 0.404533
N  2.248178 -0.981823 -0.497934
N  0.608928 1.78001 1.198762
N  0.640873 -2.792819 -0.553467
N  2.826762 2.598703 0.691355
N  1.296975 3.949952 1.855382
C  -1.183368 -0.793625 0.934152
C  -2.076018 -1.635702 -0.005559
C  -3.450757 -0.921929 0.041928
C  -3.036331 0.568727 0.141729
C  -2.593843 1.209076 -1.192605
C  0.952915 0.585676 0.579963
C  1.042876 -1.509329 -0.238046
C  2.201027 0.341463 0.002543
C  3.225604 1.401615 -0.008897
C  1.627825 2.752046 1.228914
C  1.608297 -3.688713 -1.203212
H  -1.150132 -1.239524 1.946041
H  -1.687908 -1.616306 -1.043079
H  -3.96404 -1.215281 0.977467
H  -3.806973 1.188869 0.625552
H  -1.71029 0.686489 -1.609023
H  -2.335758 2.271771 -1.026644
H  -2.818388 -3.50176 -0.014953
H  -4.294328 -0.573403 -1.742643
H  -0.361346 1.942023 1.480759
H  -0.174833 -3.19916 -0.080868
H  -3.608767 1.590034 -2.937921
H  2.463704 -3.928394 -0.541922
H  2.019655 -3.206898 -2.10597
H  1.093973 -4.62161 -1.489065
H  0.531926 4.021514 2.522198
H  2.038209 4.647238 1.874256
