program: Gaussian 09
title: 000266344
version: EM64L-G09RevD.01
frameworkgroup: C1[X(C12H17N5O5)]
method: RPBEPBE
basis: SDD
operation: Freq
keyword: #p
keyword: freq=noraman
keyword: PBEPBE/SDD
title: #p freq=noraman PBEPBE/SDD
converged: YES YES NO NO
title: Mulliken charges:
elementType: O O O O O N N N N N C C C C C C C C C C C C H H H H H H H H H H H H H H H H H
charge: -0.266334 -0.416633 -0.497364 -0.423978 -0.213051 -0.212418 -0.181896 -0.013288 -0.401746 -0.001971 -0.202483 -0.161869 -0.190205 -0.106748 -0.318241 0.305913 0.203398 -0.126906 0.009781 -0.612426 -0.643486 -0.268638 0.310240 0.285946 0.285134 0.258813 0.217680 0.237340 0.359424 0.385653 0.381834 0.351036 0.210322 0.254223 0.237231 0.229852 0.229943 0.270369 0.235546
chargesum: 0.00000
title: Mulliken charges with hydrogens summed into heavy atoms:
elementType: O O O O O N N N N N C C C C C C C C C C C C
charge: -0.266334 -0.057209 -0.111711 -0.072942 -0.213051 -0.212418 -0.181896 -0.013288 -0.019912 -0.001971 0.107757 0.124077 0.094929 0.152065 0.136780 0.305913 0.203398 -0.126906 0.009781 0.089350 0.086678 -0.033092
polarizability: 2.12615233e+02 -8.11917137e+00 2.15024639e+02 7.16421407e+00 3.42523670e+00 1.23408936e+02
1716.lowfreq: -5.4029 -0.0009 -0.0008 0.0002 7.1961 12.1272 36.9068 42.2651 66.4715
frequency: 36.8315 42.0991 66.4576 76.1130 85.5070 96.5545 114.0398 129.4901 140.5425 151.1513 186.4760 191.4515 199.5016 216.3970 229.5622 254.6989 280.8952 298.8177 309.0293 320.3774 332.6530 336.6094 366.5050 377.4909 403.9386 420.1931 434.6853 457.1989 474.0630 490.5623 513.4459 522.7488 589.3643 593.0998 635.1158 646.6407 698.7478 718.4345 725.3319 746.2075 762.6672 772.7461 820.9967 863.3595 873.4274 875.3314 898.2471 904.3782 934.1826 947.5462 967.2618 973.2940 1001.8328 1017.2768 1021.8089 1027.6214 1049.6343 1061.5909 1092.4054 1093.7151 1125.8105 1144.9789 1160.7383 1168.8273 1187.1647 1199.7446 1209.2819 1227.3903 1249.8130 1267.4295 1282.1907 1293.9280 1302.8494 1313.1956 1322.8044 1342.3402 1359.1697 1361.4047 1371.9349 1372.7363 1383.1150 1414.9689 1429.1231 1442.4376 1455.7350 1458.5157 1474.6271 1480.3889 1490.2822 1512.6313 1549.9861 1573.5155 1611.3617 1627.4548 2940.8264 2965.2161 2997.0240 3040.3091 3041.3732 3051.4862 3057.5944 3058.7441 3089.4859 3103.0664 3108.9128 3117.1878 3121.8966 3158.1761 3532.9438 3549.9489 3608.5998
redmass: 5.5362 7.9804 6.9341 3.0597 5.1515 4.4984 3.1024 3.2809 6.4781 4.6185 1.9445 1.6042 2.8045 2.2034 3.8288 3.3728 7.4365 4.0912 3.5676 1.8654 1.8091 5.1812 3.9608 1.2321 3.2502 2.8087 1.6875 3.0652 4.8947 7.3655 3.8369 5.8704 9.0114 6.6914 7.1733 11.8678 9.0743 7.0773 5.5666 4.4441 3.6874 11.7590 6.8045 1.8832 1.9741 5.3204 4.2731 1.3263 5.8689 4.0699 2.1442 4.2764 4.5269 3.7683 3.7721 4.8262 1.6927 2.5658 1.2428 2.1786 3.1744 1.4386 1.2392 3.0626 1.5658 2.2048 1.2671 1.5370 5.0222 1.3236 1.6777 1.5418 2.4412 1.3972 4.0945 1.1625 1.3359 1.4920 1.3126 1.4328 1.4811 1.6684 1.1405 1.2802 1.0869 1.0613 1.0748 1.0552 1.0942 7.9338 3.3902 4.2708 2.1566 8.4543 1.0461 1.0407 1.0666 1.0867 1.0858 1.0879 1.0879 1.0949 1.0881 1.0981 1.1006 1.0920 1.1001 1.0895 1.0662 1.0657 1.0669
irintensity: 0.9603 3.6277 1.8775 2.4672 3.1247 1.8096 6.9196 4.1319 2.2757 3.6566 1.3174 0.6702 0.3864 7.0152 7.5374 7.9494 7.1890 4.4099 13.8461 33.0816 61.6799 14.5934 26.9468 130.7511 34.1149 40.8389 68.9490 5.1579 4.3109 15.5251 5.8328 19.6199 1.4503 6.5663 3.8944 5.2250 1.4112 25.8248 18.9913 21.7031 5.5260 9.5745 24.3045 21.9789 104.6922 41.2262 60.7381 65.1014 85.0004 70.8878 38.3672 17.5251 86.7470 46.8700 76.5449 17.5834 14.4336 6.9666 8.1271 13.9626 74.1180 38.9101 39.8182 42.8665 10.9856 19.9655 11.6510 31.7421 81.2108 7.4398 1.7482 6.6905 12.8773 10.1107 138.9748 19.7694 2.5176 5.5769 17.7346 6.0229 10.0809 38.5337 7.3947 4.0305 2.9879 20.6275 5.1773 33.1194 3.6082 275.5065 109.4344 139.7257 55.6831 481.7927 88.5812 84.7356 29.0685 1.7266 9.2500 25.2908 45.7948 32.2815 6.8034 15.3995 8.3251 24.6365 15.8884 858.1455 16.5569 6.5125 40.3870
temp: 298.150 k
press: 1.00000 atm
elementType: 8 8 8 8 8 7 7 7 7 7 6 6 6 6 6 6 6 6 6 6 6 6 1 1 1 1 1 1 1 1 1 1 1 1 1 1 1 1 1
symmnumber: 1
zpe: 792998.6 jmol-1
zpe.correction: 0.302037 hartree
zpe.thermalcorrener: 0.323072 hartree
zpe.thermalcorrenthalpy: 0.324016 hartree
zpe.thermalcorrgfe: 0.252854 hartree
zpe.sumelectzpe: -1115.627076 hartree
zpe.sumelectthermal: -1115.606042 hartree
zpe.sumelectthermalent: -1115.605097 hartree
zpe.sumelectthermalfe: -1115.676260 hartree
dipole: -12.2654 2.3121 -3.3182
dipole: 12.9150
quadrupole: -164.5499 -112.7082 -139.5633
quadrupole: 24.1708 6.1560 9.1112
quadrupole: -25.6094 26.2323 -0.6229 24.1708 6.1560 9.1112
hfenergy: -1115.9291135 hartree
pointgroup: C01 [X(C12H17N5O5)]
dipole: -4.8656169 -1.2666641 0.7343351 debye
polarizability: 212.8163836|8.4248058|205.2340166|-0.4968718|29.0320246|132.9984085 unknown
InChI: InChI=1S/C12H17N5O5/c1-16(2)12-15-6-9(13-4-14-10(6)21)17(12)11-8(20)7(19)5(3-18)22-11/h4-5,7-8,11,13,18-20H,3H2,1-2H3
charge 0 multiplicity 1
39 atoms
O  -2.217544 -1.001708 -0.689072
O  -2.854544 -1.561238 2.301367
O  -2.501427 1.935999 1.228506
O  -2.679978 0.902687 -2.847144
O  4.340674 1.303265 0.472671
N  0.077883 -0.650732 0.192393
N  0.857497 -2.865005 -0.588177
N  2.339868 -0.966597 -0.16069
N  0.229017 1.76285 0.940636
N  2.482393 2.65417 1.028029
C  -1.271522 -1.144089 0.451968
C  -2.056859 -0.526926 1.637732
C  -2.995503 0.558249 1.008033
C  -3.0366 0.243569 -0.513746
C  -2.519914 1.341328 -1.462308
C  0.737564 0.545026 0.527008
C  1.134894 -1.539505 -0.241732
C  2.114457 0.335585 0.328786
C  3.091714 1.403637 0.59318
C  2.003854 -3.793405 -0.4317
C  0.06473 -3.113378 -1.823984
C  1.179968 2.769268 1.170567
H  -1.149721 -2.233425 0.587946
H  -1.41497 -0.118032 2.433338
H  -3.991691 0.457502 1.472921
H  -4.049508 -0.04235 -0.84599
H  -1.465761 1.598851 -1.240372
H  -3.133293 2.250413 -1.364716
H  -3.341395 -2.090399 1.616116
H  -2.903672 2.314561 2.047156
H  -0.788839 1.94943 1.067856
H  -2.159592 0.066807 -2.967459
H  1.622199 -4.829227 -0.461861
H  2.497955 -3.612331 0.534642
H  2.760954 -3.657879 -1.230671
H  -0.327689 -4.144874 -1.799131
H  0.691027 -2.994138 -2.734448
H  -0.78754 -2.419111 -1.886928
H  0.755113 3.726853 1.497677
