program: Gaussian 09
title: 000266334
version: EM64L-G09RevD.01
frameworkgroup: C1[X(C7H6N4O2S2)]
method: RPBEPBE
basis: SDD
operation: Freq
keyword: #p
keyword: freq=noraman
keyword: PBEPBE/SDD
title: #p freq=noraman PBEPBE/SDD
converged: NO NO NO NO
title: Mulliken charges:
elementType: S S O O N N N N C C C C C C C H H H H H H
charge: 0.215034 0.242370 -0.248923 -0.231850 0.028542 0.016608 -0.134209 -0.132715 -0.404718 0.152299 0.386807 -0.256876 0.247611 -0.661914 -0.700796 0.238619 0.230909 0.221592 0.234550 0.248054 0.309004
chargesum: 0.00000
title: Mulliken charges with hydrogens summed into heavy atoms:
elementType: S S O O N N N N C C C C C C C
charge: 0.215034 0.242370 -0.248923 -0.231850 0.028542 0.016608 -0.134209 -0.132715 -0.404718 0.152299 0.386807 0.212652 0.247611 0.042283 -0.391793
polarizability: 2.21274913e+02 1.66980017e+01 1.71820867e+02 -1.74787711e+01 6.16315978e+00 7.89239875e+01
1716.lowfreq: -4.0303 0.0019 0.0027 0.0030 4.9839 5.4882 24.7995 44.5280 51.1324
frequency: 24.7039 44.5188 51.1045 75.0884 94.7524 108.9864 137.0761 172.7820 213.1053 253.1173 265.9947 273.3401 293.1658 307.9157 332.5800 372.7541 426.3081 451.8754 490.8373 527.0126 613.8688 620.7252 652.9498 673.2868 730.3265 734.4834 792.4418 815.7759 820.5164 844.6723 856.5999 914.1313 966.1280 1011.3972 1094.8759 1122.5279 1156.5909 1160.6588 1219.6112 1277.1093 1281.6136 1350.8944 1387.0157 1391.3200 1458.1763 1463.6299 1479.3534 1483.7026 1504.7720 1537.4053 1611.8107 2995.6008 3034.1310 3091.1068 3098.5164 3124.4197 3212.7911
redmass: 5.0892 7.6306 3.5780 6.0693 10.4595 5.9365 5.5657 5.6709 1.4448 5.1096 11.7462 16.7643 8.5865 3.8667 7.8105 11.2829 3.7932 7.2380 10.2364 13.3461 12.0774 11.8568 9.3475 7.8564 4.0184 10.5137 3.4587 2.0320 3.5058 1.3759 6.0017 5.6108 3.7778 2.9714 2.1820 6.8655 1.8422 2.1002 3.0185 1.3142 4.2483 1.3741 5.1600 1.2730 1.1113 1.0464 9.8586 1.0628 12.4396 12.8298 10.2103 1.0362 1.0598 1.0973 1.1030 1.1065 1.0929
irintensity: 2.5708 0.8005 1.9354 0.6374 0.6432 0.4270 1.4212 1.4102 6.9893 10.1747 2.9330 38.2216 13.0584 1.9697 31.0922 1.0852 3.8455 1.4906 2.3373 1.5008 2.4780 4.4341 2.3869 0.8320 17.1406 5.9654 40.3032 32.2302 31.8488 46.4743 52.7646 53.8196 5.5823 84.7275 41.9338 312.9343 63.1466 1.0686 10.9825 31.5168 45.0621 12.0628 88.5820 20.5767 27.7130 12.7487 191.9568 13.0775 143.7604 123.7946 123.3562 18.5719 27.5825 32.0500 1.6483 28.6458 9.1578
temp: 298.150 k
press: 1.00000 atm
elementType: 16 16 8 8 7 7 7 7 6 6 6 6 6 6 6 1 1 1 1 1 1
symmnumber: 1
zpe: 343938.1 jmol-1
zpe.correction: 0.130999 hartree
zpe.thermalcorrener: 0.145828 hartree
zpe.thermalcorrenthalpy: 0.146773 hartree
zpe.thermalcorrgfe: 0.086690 hartree
zpe.sumelectzpe: -1434.753362 hartree
zpe.sumelectthermal: -1434.738532 hartree
zpe.sumelectthermalent: -1434.737588 hartree
zpe.sumelectthermalfe: -1434.797671 hartree
dipole: 0.1267 -0.2374 0.8567
dipole: 0.8979
quadrupole: -85.7043 -110.7354 -100.5207
quadrupole: -12.8935 -2.9464 1.5937
quadrupole: 13.2825 -11.7486 -1.5339 -12.8935 -2.9464 1.5937
hfenergy: -1434.8843607 hartree
pointgroup: C01 [X(C7H6N4O2S2)]
dipole: 0.1090477 -0.0248219 0.3350992 debye
dipolederiv: -0.5644683 0.0169957 0.1392822 0.0066002 -0.2728396 0.0764638 0.1374392 -0.0021905 0.0537306 -0.4420662 0.0133215 0.3716784 -0.2346719 -0.2227532 0.0145739 0.2626438 -0.1451623 -0.127526 -1.5534603 0.4291414 0.2841136 0.5025862 -0.5230044 -0.0244106 0.530586 -0.1135298 -0.5306437 -0.7434399 0.0891851 0.1604016 0.0540287 -0.6395838 0.2686732 0.198138 0.1608524 -0.5365957 -0.7620842 0.1036007 0.127715 0.9356218 0.3660108 -0.2606938 0.0586619 -0.1356517 0.0166022 -0.6799852 0.0787967 0.5966186 -0.342466 0.4137032 0.4217975 0.3548308 -0.0443133 -0.2376101 0.8904611 0.0873676 -0.2529505 -0.6614988 -0.4730647 0.2320163 -0.1727216 0.0474698 -0.1202697 0.5512668 -0.3963613 -0.665424 0.0449293 -0.3755586 -0.1749309 -0.414556 0.2154373 0.2380528 0.8240406 0.1560512 -0.1544997 0.2770395 0.6483223 -0.2136774 -0.2754142 -0.1261725 0.0038558 -0.5130523 0.0114776 0.102405 0.1116405 -0.3906625 0.0785888 0.1650929 0.1820248 -0.0595086 -0.149888 -0.2047115 0.0380664 0.0055473 -0.2050814 -0.0671684 0.2061106 0.10569 0.0100072 0.7934845 -0.2298168 -0.0013737 -0.5183623 0.462569 0.0928177 0.0211924 0.0012709 0.3163297 1.7882137 -0.4997236 -0.4793419 -0.5989287 1.0099224 -0.2889024 -0.7286662 -0.1170904 0.7936538 -0.1207023 0.0314738 -0.0752923 0.1188889 -0.011621 -0.0650204 -0.0774844 -0.0120863 -0.0847203 0.4650962 0.3377787 -0.3147197 0.2673452 0.1421814 -0.0363539 -0.3004491 -0.0476699 -0.0352615 -0.034389 -0.0919896 -0.0231155 0.0206165 -0.0623933 -0.0267601 -0.042391 0.0473186 0.0844472 -0.0191177 0.0548348 0.0636842 0.0564845 0.0720691 0.0093384 0.0624348 -0.0300385 -0.1003093 -0.0680244 0.1365077 -0.0125833 0.1447152 -0.0334942 -0.0016268 -0.054585 0.0064502 0.1127242 0.0672222 -0.0848366 -0.0130758 -0.1404087 -0.0574556 0.0131059 0.0084706 0.0396621 0.0720416 0.0635232 -0.0120993 0.1073484 -0.0315849 0.1039182 -0.0165991 0.0744514 -0.02436 -0.0646571 0.2073696 -0.0269939 0.0010629 -0.0181225 0.0488161 -0.0312318 -0.013785 -0.007911 0.1956569 unknown
polarizability: 210.4240817|9.6767869|170.0805044|-43.5497168|-14.0976442|91.5151818 unknown
InChI: InChI=1S/C7H6N4O2S2/c1-2-13-7(12)5(11-9)6(15)4(3-14)10-8/h3H,2H2,1H3
charge 0 multiplicity 1
21 atoms
S  -1.37662 2.701092 -0.322904
S  -3.886268 -1.323666 1.237307
O  2.484427 -0.40113 -1.002138
O  1.032913 -1.322325 0.586546
N  1.190636 2.00926 -0.825799
N  -1.631023 -1.322856 -0.303455
N  0.605568 3.117546 -0.885536
N  -2.44058 -2.23822 -0.05107
C  -0.823966 1.032604 -0.136454
C  0.550009 0.835762 -0.428722
C  -1.772068 -0.020605 0.213866
C  3.420326 -1.558567 -0.818102
C  1.342261 -0.406457 -0.213957
C  4.380153 -1.29559 0.344837
C  -2.917768 0.098148 1.020884
H  2.820679 -2.470473 -0.652324
H  3.94278 -1.612683 -1.785915
H  5.122875 -2.112888 0.400566
H  4.922471 -0.345839 0.200458
H  3.837766 -1.259178 1.304157
H  -3.19187 1.033964 1.510555
