program: Gaussian 09
title: 000266333
version: EM64L-G09RevD.01
frameworkgroup: C1[X(C5H2N4O2S2)]
method: RPBEPBE
basis: SDD
operation: Freq
keyword: #p
keyword: freq=noraman
keyword: PBEPBE/SDD
title: #p freq=noraman PBEPBE/SDD
converged: YES YES NO NO
title: Mulliken charges:
elementType: S S O O N N N N C C C C C H H
charge: 0.220077 0.246834 -0.397974 -0.222956 0.034547 0.020185 -0.126136 -0.126846 -0.404349 0.389753 0.187313 -0.695030 0.171593 0.310229 0.392759
chargesum: 0.00000
title: Mulliken charges with hydrogens summed into heavy atoms:
elementType: S S O O N N N N C C C C C
charge: 0.220077 0.246834 -0.005215 -0.222956 0.034547 0.020185 -0.126136 -0.126846 -0.404349 0.389753 0.187313 -0.384802 0.171593
polarizability: 2.00189436e+02 -2.30173153e-01 1.40687816e+02 -8.56994726e+00 8.15554799e+00 5.68985866e+01
1716.lowfreq: -8.9180 -5.6403 -0.0017 -0.0017 0.0023 5.6167 38.4025 52.9029 90.9399
frequency: 38.3277 52.8972 90.9360 105.9011 149.7616 182.4698 258.8106 269.7150 287.4208 311.6327 320.8379 383.8149 449.6761 499.0398 525.7461 564.0104 593.5249 626.6011 637.8169 668.9280 686.1432 741.8735 815.3686 845.8898 854.2260 899.0592 965.5686 1058.3958 1159.3657 1195.2662 1247.3525 1306.6291 1395.1538 1478.5101 1516.2701 1545.2169 1634.4534 3210.5991 3519.9647
redmass: 10.1312 12.0872 12.8026 11.4387 10.9713 10.3789 16.5243 17.2429 9.7385 9.7215 11.5151 11.8867 7.2623 13.7935 10.1896 1.6999 6.0821 4.8478 4.5548 5.4434 9.8394 11.1193 11.5763 1.4446 5.5384 11.4296 4.0485 2.8552 2.9108 2.0682 3.7727 4.3395 7.4214 10.9236 13.7823 13.0615 9.3971 1.0929 1.0643
irintensity: 3.3800 0.3609 1.5584 0.1104 0.3936 3.7682 10.2497 39.0241 8.6701 8.8096 9.3371 2.9062 1.4046 2.7581 7.6901 70.8008 45.3119 48.9861 48.1628 28.7345 24.3592 10.8898 78.0986 49.1020 50.7234 47.0324 1.4259 348.3998 0.6196 5.8245 11.8701 10.5347 98.3466 169.6896 212.3110 119.4613 190.9347 9.0225 66.0375
temp: 298.150 k
press: 1.00000 atm
elementType: 16 16 8 8 7 7 7 7 6 6 6 6 6 1 1
symmnumber: 1
zpe: 197941.1 jmol-1
zpe.correction: 0.075392 hartree
zpe.thermalcorrener: 0.087199 hartree
zpe.thermalcorrenthalpy: 0.088143 hartree
zpe.thermalcorrgfe: 0.035731 hartree
zpe.sumelectzpe: -1356.310724 hartree
zpe.sumelectthermal: -1356.298918 hartree
zpe.sumelectthermalent: -1356.297973 hartree
zpe.sumelectthermalfe: -1356.350385 hartree
dipole: 0.8700 -0.9169 -0.7729
dipole: 1.4816
quadrupole: -93.7976 -84.8380 -88.3522
quadrupole: -13.1546 -0.6889 1.5602
quadrupole: -4.8017 4.1579 0.6438 -13.1546 -0.6889 1.5602
hfenergy: -1356.3861163 hartree
pointgroup: C01 [X(C5H2N4O2S2)]
dipole: -0.3057724 0.3802301 -0.3189001 debye
dipolederiv: -0.5166177 0.1381414 -0.0241149 0.0868767 -0.3360504 -0.0203148 0.0280657 0.0341935 0.0930171 -0.5486665 0.2143559 -0.2155971 -0.0364206 -0.1871257 0.2034932 -0.0267156 0.2132155 -0.0391727 -0.9976107 0.5492014 -0.1621688 0.5958169 -0.6722683 0.1879129 -0.2035684 0.224168 -0.4515167 -0.7257142 -0.0523758 -0.23934 -0.0123992 -0.8009991 -0.1637908 -0.1587177 -0.1323641 -0.4246556 0.0646408 0.3360543 0.0254103 1.2069911 -0.4064281 0.0085522 0.0277816 0.0572999 0.0085307 -0.6644428 0.6905845 -0.6302643 0.2415479 0.2231678 -0.0834615 -0.1615368 0.0688348 -0.0176165 0.2761892 -0.3688634 -0.0071127 -1.2005508 0.1927939 -0.0567816 0.0144756 -0.0349515 -0.1439714 0.3061037 -0.7936638 0.6404124 -0.3083598 0.0578216 -0.1469988 0.1964938 -0.2231423 0.0323589 1.0814178 -0.0285132 -0.0011203 0.1159717 0.5222294 0.0844952 0.0425669 -0.0164129 -0.0666214 -0.3713243 -0.1651789 0.0779286 0.0509359 -0.0982175 0.0624402 -0.1526328 0.0551969 0.0490351 -0.4682554 -0.0299201 -0.0336183 0.1474467 -0.5495571 -0.047976 -0.1377121 -0.0841584 0.014035 0.759522 0.0030558 0.0983323 -0.1040165 -0.0420754 -0.1225842 0.0924915 -0.1172419 -0.1264564 1.3091981 -0.2735217 0.4940768 -0.6097137 1.7532469 0.1235372 0.4339012 0.0474723 0.529481 0.148753 -0.0818274 0.0273229 -0.0672388 0.114899 0.0428579 0.026018 0.0191263 0.1870424 0.346807 -0.1375291 -0.0501468 -0.1068874 0.228563 -0.0713812 -0.0209109 -0.1112359 0.3565105 unknown
polarizability: 198.8560872|-3.2705848|140.926509|14.9068336|-8.7544107|57.9932419 unknown
InChI: InChI=1S/C5H2N4O2S2/c6-8-2(1-12)4(13)3(9-7)5(10)11/h1,10H
charge 0 multiplicity 1
15 atoms
S  0.707252 2.527323 0.123769
S  -3.828157 0.516932 -0.398197
O  2.442149 -2.172149 0.275183
O  0.326943 -2.173992 -0.696524
N  2.562847 0.554197 0.171807
N  -1.624244 -0.716113 0.648464
N  2.687481 1.799042 0.211341
N  -2.825542 -1.044788 0.683958
C  0.238179 0.827777 0.032286
C  -1.172733 0.45705 0.012968
C  1.328085 -0.084675 0.058481
C  -2.237027 1.184375 -0.553539
C  1.271912 -1.549853 -0.160368
H  -2.079369 2.12212 -1.089269
H  2.382725 -3.145151 0.071841
