program: Gaussian 09
title: 000266330
version: EM64L-G09RevD.01
frameworkgroup: C1[X(C2HBrN2S)]
method: RPBEPBE
basis: SDD
operation: Freq
keyword: #p
keyword: freq=noraman
keyword: PBEPBE/SDD
title: #p freq=noraman PBEPBE/SDD
converged: NO NO NO NO
title: Mulliken charges:
elementType: Br S N N C C H
charge: 0.092434 0.274762 0.051479 -0.163885 -0.025710 -0.536888 0.307808
chargesum: 0.00000
title: Mulliken charges with hydrogens summed into heavy atoms:
elementType: Br S N N C C
charge: 0.092434 0.274762 0.051479 -0.163885 -0.025710 -0.229080
polarizability: 1.04790043e+02 -5.10996117e+00 6.16391786e+01 -2.26046684e-02 -1.74233185e-02 2.24099027e+01
1716.lowfreq: -23.8303 -7.8005 -7.1301 -0.0019 -0.0004 0.0014 175.4650 226.5456 298.5122
frequency: 175.4635 226.5454 298.5116 322.9176 445.4113 617.6868 650.2680 823.1726 825.8032 836.1850 1038.6521 1198.1835 1383.4969 1426.1291 3238.2151
redmass: 9.4762 10.4053 25.2293 18.3213 6.3735 9.2560 12.8180 1.2843 8.8765 6.5298 2.5387 1.8876 7.9714 13.6173 1.0942
irintensity: 0.0038 1.5691 19.9258 31.2721 0.1505 3.5003 1.5642 52.0712 56.2608 59.1903 29.0034 45.4162 22.4484 161.9319 7.4261
temp: 298.150 k
press: 1.00000 atm
elementType: 35 16 7 7 6 6 1
symmnumber: 1
zpe: 80787.7 jmol-1
zpe.correction: 0.030770 hartree
zpe.thermalcorrener: 0.036365 hartree
zpe.thermalcorrenthalpy: 0.037310 hartree
zpe.thermalcorrgfe: -0.000300 hartree
zpe.sumelectzpe: -597.343010 hartree
zpe.sumelectthermal: -597.337415 hartree
zpe.sumelectthermalent: -597.336471 hartree
zpe.sumelectthermalfe: -597.374080 hartree
dipole: -0.5289 -2.7228 -0.0014
dipole: 2.7737
quadrupole: -51.3427 -51.4527 -51.5269
quadrupole: -2.5229 -0.0159 -0.0105
quadrupole: 0.0981 -0.0119 -0.0861 -2.5229 -0.0159 -0.0105
hfenergy: -597.3737803 hartree
pointgroup: C01 [X(C2H1Br1N2S1)]
dipole: 0.3119335 -1.0457242 0.0014831 debye
dipolederiv: -0.5321927 -0.0236357 -0.0001732 -0.0139593 0.0063948 -0.000172 0.0003403 -0.0001231 0.0668711 -0.2632843 -0.328239 0.0002388 -0.1961462 -0.5004541 0.0012844 0.003176 0.0028341 0.1504378 -0.8699756 -1.0489679 0.0009953 -0.2694352 -0.2066758 0.0012239 -0.0006194 -0.0023145 0.0138326 0.2403058 1.0512152 -0.0004443 0.4492422 0.5674455 -0.0030943 -0.0012281 0.0000368 -0.1703107 1.2583142 0.2064279 0.0003478 -0.0817875 -0.0617314 0.0000656 0.0000349 -0.0001057 -0.0724957 0.0664142 0.0857025 -0.0013117 0.0696678 0.0721309 0.0006136 -0.0015096 -0.0006583 -0.2215119 0.1004183 0.057497 0.0003473 0.0424183 0.1228901 0.0000787 -0.000194 0.0003307 0.2331767 unknown
polarizability: 103.3813788|9.2147551|63.0478312|-0.0389495|-0.022338|22.4099142 unknown
InChI: InChI=1S/C2HBrN2S/c3-2-1-6-5-4-2/h1H
charge 0 multiplicity 1
7 atoms
Br 2.601167 -0.011452 0.001141
S  -1.834634 -0.916366 0.003929
N  -0.055591 1.121746 0.000997
N  -1.323603 1.08274 -0.002725
C  0.677144 -0.068434 0.000942
C  -0.11104 -1.219267 -0.001861
H  0.288457 -2.232266 -0.003023
