program: Gaussian 09
title: 000266329
version: EM64L-G09RevD.01
frameworkgroup: C1[X(C10H9N3O2S)]
method: RPBEPBE
basis: SDD
operation: Freq
keyword: #p
keyword: freq=noraman
keyword: PBEPBE/SDD
title: #p freq=noraman PBEPBE/SDD
converged: NO YES NO NO
title: Mulliken charges:
elementType: S O O N N N C C C C C C C C C C H H H H H H H H H
charge: 0.278990 -0.285376 -0.287296 -0.388616 -0.051662 -0.203283 0.466009 -0.479566 -0.378664 -0.363362 -0.224455 -0.226825 -0.229850 0.316785 0.335676 -0.640304 0.228949 0.246163 0.234548 0.266238 0.229774 0.230742 0.232246 0.356554 0.336584
chargesum: 0.00000
title: Mulliken charges with hydrogens summed into heavy atoms:
elementType: S O O N N N C C C C C C C C C C
charge: 0.278990 -0.285376 -0.287296 -0.032062 -0.051662 -0.203283 0.466009 -0.004455 -0.144116 -0.097123 0.005319 0.003917 0.002395 0.316785 0.335676 -0.303719
polarizability: 2.00585381e+02 1.29702423e+01 1.40632425e+02 -1.22346785e+01 -1.92641716e+01 1.09280955e+02
1716.lowfreq: -4.0245 -0.0015 0.0016 0.0020 2.1117 11.6862 20.9800 33.2328 40.1758
frequency: 20.7774 33.0552 40.1389 75.8315 90.8450 109.2835 156.6752 232.2335 245.2879 290.1223 325.0602 340.3772 359.1318 392.3021 403.8674 455.6436 488.2456 580.0389 616.9556 617.8239 628.5751 654.6972 662.2367 696.1073 704.2303 743.1981 768.0648 813.8974 816.5680 829.0340 857.2020 859.8753 935.4388 946.6750 968.5668 981.6763 989.3783 993.8378 1001.4749 1027.0486 1091.7463 1135.8429 1169.4862 1174.6223 1189.4103 1222.7291 1238.4084 1250.3168 1330.1488 1347.9692 1380.1672 1386.3189 1442.9912 1461.7322 1484.9049 1491.3725 1552.0471 1594.9080 1615.0097 1641.7963 3040.8378 3116.5840 3121.7828 3130.0186 3141.9859 3153.1357 3166.7875 3249.7410 3554.3817
redmass: 6.3251 5.3332 6.1493 8.2932 8.2544 6.2045 6.2015 7.1470 8.2002 6.9825 5.2388 4.6978 8.6175 3.2577 2.8058 6.6868 4.2179 5.0442 2.7885 1.7170 5.0184 8.3666 6.6667 6.5318 1.9421 3.8187 3.0351 1.3033 3.2266 5.3585 1.5190 3.6572 1.4852 3.1849 2.2172 1.4495 4.4943 4.3045 1.3341 2.2124 1.5149 1.9401 2.0863 1.0544 1.1209 2.8669 1.1626 4.4371 1.2597 1.2716 9.5880 8.1375 2.1764 1.1308 2.2981 2.1576 9.5948 6.0862 6.0871 8.8875 1.0590 1.1069 1.0876 1.0873 1.0919 1.0964 1.1016 1.0939 1.0769
irintensity: 0.0189 0.0850 0.0624 0.0823 12.4730 2.6589 1.3991 16.0582 2.3514 4.1739 7.6841 12.8293 27.9947 9.9134 0.0155 1.2257 14.0431 23.4645 31.1333 53.9659 6.8029 1.7306 9.5448 30.1555 67.1338 42.7287 47.2510 50.1932 18.4263 17.2902 9.1690 32.8994 9.2982 79.8704 21.5801 4.9212 61.3469 152.3358 0.3060 2.8119 7.9527 120.8717 199.6262 0.1490 0.1913 30.3179 10.7611 175.2907 1.9823 14.0491 141.0184 1.2692 9.3690 19.0695 3.4123 316.8187 467.6077 1.8699 0.5732 169.6446 31.9505 4.0387 6.2919 1.4039 16.2841 26.3353 19.3087 18.4925 67.1117
temp: 298.150 k
press: 1.00000 atm
elementType: 16 8 8 7 7 7 6 6 6 6 6 6 6 6 6 6 1 1 1 1 1 1 1 1 1
symmnumber: 1
zpe: 470303.8 jmol-1
zpe.correction: 0.179129 hartree
zpe.thermalcorrener: 0.193303 hartree
zpe.thermalcorrenthalpy: 0.194247 hartree
zpe.thermalcorrgfe: 0.135057 hartree
zpe.sumelectzpe: -1098.056491 hartree
zpe.sumelectthermal: -1098.042317 hartree
zpe.sumelectthermalent: -1098.041373 hartree
zpe.sumelectthermalfe: -1098.100563 hartree
dipole: -3.9344 -0.3977 -0.5073
dipole: 3.9868
quadrupole: -105.5702 -92.1370 -101.8236
quadrupole: 2.7764 -9.6631 0.7335
quadrupole: -5.7266 7.7066 -1.9800 2.7764 -9.6631 0.7335
hfenergy: -1098.2356199 hartree
pointgroup: C01 [X(C10H9N3O2S1)]
dipole: -1.4762913 0.3946454 -0.353762 debye
dipolederiv: -0.0936288 -0.0391672 -0.1953253 0.0417808 -0.2066002 -0.3125551 -0.1552792 -0.3616144 -0.2990661 -1.9233087 0.1939853 -0.2969084 0.3356931 -0.3995337 0.003257 -0.8468381 0.1546624 -0.710696 -0.7806964 0.0736638 -0.1040976 0.2856293 -0.7189202 -0.1229449 -0.045451 -0.2492086 -0.5152828 -1.6432654 0.4008603 -0.4058289 0.8546774 -0.577997 0.2317088 -0.3188211 0.0566435 -0.4067959 -0.3425807 -0.5803764 -0.7349942 -0.0276914 0.0088671 0.0506768 -0.2488624 -0.4002113 -0.6198485 -0.17241 0.5163514 0.5353818 0.1468138 0.1000781 0.3742394 0.1542075 0.694173 0.583414 -0.0815022 0.0436697 -0.0141625 -0.0145759 -0.1146178 0.122028 0.0428204 0.0321148 -0.0869386 1.2340427 -0.0787376 -0.059856 -0.4371795 0.3788373 -0.1644624 -0.1533912 -0.0962814 0.3698069 -0.0818362 0.0281661 -0.0526384 0.074203 -0.1048543 0.0388494 0.0553807 0.059168 0.0859039 -0.044753 0.0928874 0.0391231 0.0582336 -0.0942934 0.0321374 -0.0019074 0.007257 -0.0629444 -0.0026858 0.1197492 0.0718147 0.1218276 -0.0524557 0.0578004 0.089537 0.0514127 -0.0777836 -0.141426 0.0191896 -0.0131417 0.0079355 -0.1133115 0.0512927 -0.0252183 0.0794093 0.1280366 -0.0058814 0.0971939 -0.0813041 0.0781227 -0.0887654 -0.0127534 -0.0762476 -0.017242 0.0197524 2.350051 -0.5526888 0.5683692 -1.011379 1.1139416 0.0483775 0.7956901 0.2507045 0.8212821 1.0986851 -0.0468797 0.5805578 -0.0384072 -0.0287206 -0.1687588 0.7376349 -0.1824858 0.4468954 -0.0187873 -0.0274947 0.1795863 -0.2296409 -0.0903847 0.0027258 0.0002836 0.1498651 -0.1195501 -0.038316 0.0293402 -0.0565046 0.0391112 0.0970292 -0.0330846 -0.0193119 0.0565984 -0.0981408 -0.027929 -0.0614459 0.0231307 0.0336849 -0.0439972 0.0134298 0.0321386 -0.0959727 0.0881687 0.1235355 -0.0246833 0.0374253 -0.0240712 0.1172694 -0.036166 0.0117617 -0.0488349 -0.1001523 0.0781069 -0.1023262 -0.0420088 -0.1064537 0.0887389 -0.0319136 -0.0571806 -0.0196132 0.0790083 -0.0176321 -0.1161935 -0.0467411 -0.1321577 0.0655218 -0.0553549 -0.0507158 -0.0579942 0.0577939 0.1008709 -0.0332869 0.0080342 -0.0312898 0.1195234 -0.0593173 0.0366621 -0.05736 -0.1010162 -0.0152418 -0.0819986 0.0971161 -0.0922544 0.1116394 0.0314664 0.1064911 0.0302453 0.020691 0.2483057 0.0791688 -0.031178 0.0270779 0.2503793 -0.034342 -0.0598848 -0.0188026 0.2923913 0.1982834 0.0510532 -0.0058495 0.0403098 0.1826264 -0.0263364 -0.0034985 -0.0166328 0.2050705 unknown
polarizability: 197.7701372|-1.6155279|109.7837467|22.3568451|19.0883976|142.9448769 unknown
InChI: InChI=1S/C10H9N3O2S/c14-10(11-9-7-16-13-12-9)15-6-8-4-2-1-3-5-8/h1-5,7,11H,6H2
charge 0 multiplicity 1
25 atoms
S  4.717179 -0.685523 1.89462
O  -0.27784 0.047563 -1.542881
O  0.707499 1.14149 0.308333
N  1.638861 -0.779956 -0.68458
N  3.639204 -1.979776 -0.176018
N  4.697505 -2.142244 0.531118
C  -2.553505 0.486075 -0.607766
C  -1.443885 1.005915 -1.4933
C  -3.575122 -0.337613 -1.145611
C  -2.584099 0.817284 0.771961
C  -4.609657 -0.827965 -0.318429
C  -3.618492 0.327834 1.599504
C  -4.632895 -0.495328 1.056349
C  0.689472 0.222945 -0.551421
C  2.78136 -0.909324 0.120151
C  3.206796 -0.122732 1.191931
H  -1.746622 1.064364 -2.550075
H  -1.058934 1.979275 -1.144529
H  -3.558062 -0.595522 -2.211774
H  -1.78877 1.445851 1.187946
H  -5.395842 -1.462495 -0.742229
H  -3.635635 0.588705 2.663404
H  -5.436608 -0.873028 1.69836
H  1.503622 -1.475837 -1.421248
H  2.672869 0.748343 1.565086
