program: Gaussian 09
title: 000266328
version: EM64L-G09RevD.01
frameworkgroup: C1[X(C12H19N3O2)]
method: RPBEPBE
basis: SDD
operation: Freq
keyword: #p
keyword: freq=noraman
keyword: PBEPBE/SDD
title: #p freq=noraman PBEPBE/SDD
converged: YES YES NO NO
title: Mulliken charges:
elementType: O O N N N C C C C C C C C C C C C H H H H H H H H H H H H H H H H H H H
charge: -0.173946 -0.211071 -0.447740 -0.018731 -0.646223 0.005867 -0.110749 -0.462990 -0.464341 -0.413050 -0.408846 -0.382275 -0.259728 -0.774921 0.209163 -0.222470 0.282080 0.227632 0.262344 0.205472 0.195981 0.212082 0.197406 0.200748 0.195819 0.194723 0.200484 0.203413 0.190198 0.298166 0.241771 0.226207 0.239002 0.335292 0.320864 0.352369
chargesum: 0.00000
title: Mulliken charges with hydrogens summed into heavy atoms:
elementType: O O N N N C C C C C C C C C C C C
charge: -0.173946 -0.211071 -0.112448 -0.018731 0.027010 0.233499 0.151595 -0.061537 -0.054853 -0.016483 -0.013640 0.011335 0.038438 -0.067941 0.209163 -0.222470 0.282080
polarizability: 1.90267618e+02 2.78764599e+00 1.45055843e+02 6.03543280e+00 1.01755334e+01 1.19548635e+02
1716.lowfreq: -8.6740 -6.8919 -0.0003 0.0006 0.0010 2.9224 22.9476 25.7223 30.3003
frequency: 22.8900 25.4356 30.0933 35.4635 94.3093 106.0376 111.0805 125.7714 144.9071 179.1908 185.2619 204.2702 214.6325 278.1408 300.8560 332.4611 357.8583 375.9730 389.9006 418.0223 424.2021 430.2423 455.0168 498.4254 526.8861 537.7605 556.7370 598.1992 655.2447 657.6233 720.6436 750.8978 784.0658 789.6371 820.1715 847.3447 877.8304 886.5550 893.9969 917.0579 924.2234 960.1210 969.0968 993.5284 1049.5037 1054.4025 1059.9756 1061.3202 1071.7700 1097.7419 1113.0633 1120.6247 1159.0449 1169.8410 1194.2353 1217.4605 1229.6169 1255.2773 1261.9356 1265.4205 1284.8174 1298.2364 1310.7244 1321.3261 1326.5462 1332.4520 1339.4051 1341.3491 1344.9257 1367.5925 1400.8419 1456.6503 1460.0756 1462.5123 1464.6333 1468.6180 1473.3050 1477.7636 1492.8015 1614.3030 1649.1493 1705.4044 2168.0101 2938.6835 2952.2525 2960.7636 2967.2743 2968.1063 2968.9825 2982.6701 2995.4874 3017.4083 3020.3445 3029.3381 3029.5509 3038.1655 3045.0690 3072.5183 3095.1985 3482.1720 3530.7132 3684.7159
redmass: 5.4999 4.2878 5.0810 4.0557 4.8898 6.5867 2.8498 5.0127 5.1195 3.1565 1.7527 4.5877 1.7917 2.3464 2.1510 4.8841 3.6145 2.5618 1.9998 1.8812 2.4819 2.9082 3.0803 3.5869 2.1683 4.2475 1.2160 4.8057 1.4382 2.3414 7.7075 3.9245 1.5599 2.3967 4.0733 2.1031 1.7353 4.2946 1.4359 2.2461 2.1716 2.3563 4.3085 1.7330 1.9261 1.5646 1.9593 1.7683 1.3887 2.4314 2.2836 1.8445 2.1793 2.5844 1.5848 1.4006 1.3723 1.2899 1.2181 1.2637 1.3128 3.3058 1.2163 1.3391 1.3750 1.4008 1.4199 1.5170 1.5130 1.4422 1.2033 1.9250 1.0967 1.0929 1.0876 1.0751 1.0708 1.0889 1.0446 1.1787 5.4327 7.2363 12.5207 1.0801 1.0616 1.0664 1.0613 1.0622 1.0649 1.0396 1.0824 1.0953 1.0829 1.0979 1.0980 1.0986 1.1015 1.0993 1.0968 1.0768 1.0461 1.1041
irintensity: 3.2243 4.4823 7.4943 3.9002 3.6282 10.7605 0.9198 1.7376 1.6696 1.1374 0.0809 0.2865 0.0031 0.8572 1.2362 0.4756 2.1619 1.2418 22.5627 39.8883 1.9685 0.2515 1.6676 13.5927 8.2420 39.5636 216.3000 1.7717 59.2029 18.9138 49.0013 9.4851 0.6561 5.6816 0.7167 8.9142 2.5809 19.0930 11.2458 2.6894 4.8524 0.9373 4.7508 24.4518 6.1442 0.4113 8.8706 0.3566 0.7185 11.6409 13.5619 21.1011 22.5796 239.1153 6.4021 5.7082 1.4251 0.7603 3.3685 1.4299 9.2410 196.5165 2.7440 16.2852 0.0382 0.1598 1.2312 2.0635 0.5857 0.8469 19.0147 684.3939 20.7295 0.6755 9.0942 21.1470 17.3450 0.9502 14.1545 52.7215 41.2856 407.8198 17.3770 4.0276 31.7749 38.0956 36.1355 25.2958 34.9355 13.1039 7.7621 52.1920 28.6420 73.7924 38.7262 19.3192 106.5924 26.2994 27.6404 32.7862 53.6926 40.4126
temp: 298.150 k
press: 1.00000 atm
elementType: 8 8 7 7 7 6 6 6 6 6 6 6 6 6 6 6 6 1 1 1 1 1 1 1 1 1 1 1 1 1 1 1 1 1 1 1
symmnumber: 1
zpe: 790313.8 jmol-1
zpe.correction: 0.301015 hartree
zpe.thermalcorrener: 0.319172 hartree
zpe.thermalcorrenthalpy: 0.320116 hartree
zpe.thermalcorrgfe: 0.252650 hartree
zpe.sumelectzpe: -782.082383 hartree
zpe.sumelectthermal: -782.064226 hartree
zpe.sumelectthermalent: -782.063281 hartree
zpe.sumelectthermalfe: -782.130747 hartree
dipole: -0.9549 2.9635 1.3547
dipole: 3.3955
quadrupole: -87.8832 -115.8303 -105.4434
quadrupole: 21.8852 8.3037 -7.7120
quadrupole: 15.1691 -12.7780 -2.3911 21.8852 8.3037 -7.7120
hfenergy: -782.3833974 hartree
pointgroup: C01 [X(C12H19N3O2)]
dipole: 0.3609755 -0.8962976 -0.9224513 debye
polarizability: 190.6100062|3.7771086|128.0375503|2.5315025|15.9068214|136.2245386 unknown
InChI: InChI=1S/C12H19N3O2/c1-8(9-5-3-2-4-6-9)10(7-13)11(16)15-12(14)17/h8-10,15H,2-6,14H2,1H3
charge 0 multiplicity 1
36 atoms
O  -1.737041 2.294707 0.820354
O  -4.525944 1.409859 1.15458
N  -2.855325 0.556081 -0.318224
N  -0.658567 -1.184557 -2.283032
N  -5.123594 0.100792 -0.68088
C  2.058391 0.128241 0.169133
C  0.604494 0.396134 0.6751
C  2.625301 1.309275 -0.669267
C  3.010969 -0.166835 1.363443
C  4.090682 1.078699 -1.110782
C  4.473363 -0.397898 0.914525
C  5.011751 0.795966 0.096238
C  -0.367472 0.782286 -0.507513
C  0.0132 -0.780964 1.485465
C  -1.730242 1.290539 0.072711
C  -0.504932 -0.301661 -1.49184
C  -4.206513 0.756507 0.135778
H  2.039145 -0.776258 -0.479486
H  0.619591 1.300338 1.317735
H  2.565185 2.239531 -0.06455
H  2.014469 1.474321 -1.578487
H  2.66246 -1.054979 1.921896
H  2.976321 0.691318 2.068495
H  4.451712 1.959768 -1.675829
H  4.128059 0.215194 -1.80688
H  4.524219 -1.316533 0.293769
H  5.110161 -0.577318 1.802418
H  6.044932 0.595159 -0.246934
H  5.055755 1.695845 0.744202
H  0.060288 1.663184 -1.022715
H  -1.030765 -0.57754 1.784867
H  0.031088 -1.719977 0.900078
H  0.583024 -0.949164 2.413794
H  -2.687947 -0.219432 -0.96806
H  -4.891657 -0.299972 -1.588314
H  -6.100864 0.146048 -0.399689
