program: Gaussian 09
title: 000266325
version: EM64L-G09RevD.01
frameworkgroup: C1[X(C9H15N2O7P)]
method: RPBEPBE
basis: SDD
operation: Freq
keyword: #p
keyword: freq=noraman
keyword: PBEPBE/SDD
title: #p freq=noraman PBEPBE/SDD
converged: YES YES NO NO
title: Mulliken charges:
elementType: P O O O O O O O N N C C C C C C C C C H H H H H H H H H H H H H H H
charge: 1.400466 -0.510950 -0.256483 -0.249425 -0.507410 -0.497000 -0.280989 -0.591817 -0.203547 -0.084930 0.062662 0.199588 0.212367 0.177221 -0.600584 -0.501021 -0.490902 -0.487495 -0.497358 0.245999 0.279308 0.249283 0.233881 0.241542 0.236172 0.238967 0.245323 0.242610 0.237648 0.255342 0.238350 0.295139 0.234634 0.233410
chargesum: 0.00000
title: Mulliken charges with hydrogens summed into heavy atoms:
elementType: P O O O O O O O N N C C C C C C C C C
charge: 1.400466 -0.510950 -0.256483 -0.249425 -0.507410 -0.497000 -0.280989 -0.591817 -0.203547 -0.084930 0.062662 0.199588 0.212367 0.177221 0.174006 0.210574 0.235997 0.243844 0.265826
polarizability: 2.13935623e+02 5.32065456e+00 1.90182814e+02 9.46771019e+00 2.44939530e+00 1.04616744e+02
1716.lowfreq: -7.7182 -3.5398 -0.0019 -0.0009 -0.0003 4.2808 24.7867 36.6542 39.6597
frequency: 24.5561 36.4815 39.6596 64.5205 69.5989 96.8133 100.0637 109.4882 111.8677 122.7530 123.2082 125.4995 132.7857 147.6218 154.5767 159.6172 164.1303 217.6087 227.7545 234.8892 261.6881 285.5729 313.0483 320.7611 327.9161 341.3416 377.7964 393.8752 417.2109 437.2589 468.1387 510.7444 553.6687 595.0642 638.1528 652.9332 679.5908 701.6696 705.8812 727.6172 741.2432 869.5411 906.8020 952.0260 959.8041 966.1400 1013.0032 1067.1035 1111.3153 1114.8999 1116.2977 1117.6391 1123.1459 1127.7475 1136.0194 1139.3095 1143.8136 1152.5871 1168.1069 1210.9824 1251.1304 1341.5673 1361.4679 1413.2610 1426.8303 1427.8562 1443.3639 1450.2536 1452.6595 1453.9482 1459.0829 1461.0381 1462.2859 1466.7631 1472.9529 1477.3148 1480.0150 1481.8688 1527.2983 1560.3006 1625.7294 2991.2571 2993.4456 3003.1926 3009.3843 3011.4382 3096.6746 3107.4263 3109.6003 3109.7098 3115.7045 3131.5496 3131.9758 3135.0482 3145.1332 3152.9636
redmass: 4.6295 5.7462 4.8926 3.3496 3.4548 2.6482 2.6184 1.1973 1.4774 3.4444 3.4970 1.1863 1.1802 2.2297 1.9706 2.2320 2.1227 4.5932 5.2696 5.4760 5.5904 7.2908 7.2392 3.6569 7.8437 5.9217 7.6728 7.6621 6.6994 6.8978 6.6650 11.2646 11.2233 6.9974 10.2521 11.2281 11.7058 9.5468 10.3342 6.1129 11.5609 6.4264 7.6683 12.0968 9.6715 10.8830 3.1403 15.9112 1.3063 2.0612 1.5885 1.2592 1.2381 1.3079 1.2620 1.2963 1.6329 2.7400 2.2231 3.0368 10.7477 4.1252 2.5365 1.2443 1.1235 1.1219 1.3566 1.0727 1.2995 1.1051 1.0496 1.0535 1.0678 1.0612 1.0549 1.1807 1.0575 1.0499 6.3723 9.1800 11.2673 1.0289 1.0281 1.0293 1.0290 1.0321 1.1059 1.1050 1.1061 1.1042 1.1051 1.1025 1.1041 1.1050 1.1045 1.1053
irintensity: 2.3178 3.1061 1.8178 5.9455 2.2203 11.3107 2.5013 1.0363 0.8192 11.8857 2.6914 0.6430 0.1642 0.0347 0.4626 0.5381 1.1091 7.8185 11.3750 2.2602 5.1815 2.6785 19.9400 1.8517 8.4261 22.4197 13.4712 32.3822 9.4498 31.5404 18.9515 21.9450 12.5806 3.3142 175.5698 1.1617 6.5210 116.9930 81.4163 4.1954 10.9925 16.5731 82.3631 177.8881 111.2974 65.7920 28.7738 116.0089 6.6773 51.5071 30.7025 0.8027 3.0896 0.1725 6.2827 1.4098 120.5594 136.7950 86.7805 2.6908 77.5075 146.2290 186.1405 47.2075 11.8610 1.7310 22.7726 11.6782 74.1907 40.0321 5.6378 29.7542 20.0820 33.0766 20.7471 45.8783 5.6252 23.3025 424.8474 197.4705 459.1651 41.4172 61.6801 44.0656 43.9536 28.7637 23.0325 24.7916 3.4078 18.7248 23.4959 0.7238 16.9779 9.3510 20.3496 15.8415
temp: 298.150 k
press: 1.00000 atm
elementType: 15 8 8 8 8 8 8 8 7 7 6 6 6 6 6 6 6 6 6 1 1 1 1 1 1 1 1 1 1 1 1 1 1 1
symmnumber: 1
zpe: 658259.8 jmol-1
zpe.correction: 0.250718 hartree
zpe.thermalcorrener: 0.273503 hartree
zpe.thermalcorrenthalpy: 0.274447 hartree
zpe.thermalcorrgfe: 0.197347 hartree
zpe.sumelectzpe: -1327.726005 hartree
zpe.sumelectthermal: -1327.703220 hartree
zpe.sumelectthermalent: -1327.702276 hartree
zpe.sumelectthermalfe: -1327.779376 hartree
dipole: 6.1978 3.2394 -2.4477
dipole: 7.4093
quadrupole: -97.4181 -102.6833 -126.7750
quadrupole: 1.7579 11.0837 -2.1414
quadrupole: 11.5407 6.2755 -17.8162 1.7579 11.0837 -2.1414
hfenergy: -1327.9767233 hartree
pointgroup: C01 [X(C9H15N2O7P1)]
dipole: -2.3200356 -1.5537859 -0.8371153 debye
polarizability: 214.7451529|6.6097816|179.0167015|4.6989123|-28.4398109|114.973327 unknown
InChI: InChI=1S/C9H15N2O7P/c1-11-8(12)6(18-19(13,16-4)17-5)7(14-2)10-9(11)15-3/h1-5H3
charge 0 multiplicity 1
34 atoms
P  2.629741 0.072812 0.932682
O  1.651995 -0.286372 -0.520331
O  -3.851108 0.133178 -0.482249
O  0.057329 -2.396457 0.35258
O  4.000936 -0.868981 0.496354
O  3.246467 1.647278 0.745165
O  0.295555 2.093896 -1.351478
O  1.917944 -0.186972 2.321299
N  -1.792978 1.073354 -0.92072
N  -1.927359 -1.160244 -0.051157
C  0.257617 -0.172055 -0.484073
C  -0.332869 1.069056 -0.949478
C  -2.484368 -0.027392 -0.469214
C  -0.551258 -1.233103 -0.06026
C  -2.498168 2.296979 -1.364259
C  -0.800882 -3.441227 0.951107
C  -4.655485 -1.010319 0.00949
C  3.849821 -2.346016 0.487922
C  3.579373 2.1729 -0.61213
H  -3.157284 2.070658 -2.217926
H  -1.720108 3.01672 -1.660534
H  -3.105383 2.707406 -0.541321
H  -1.551399 -3.793408 0.223919
H  -1.308297 -3.052642 1.849763
H  -0.099978 -4.245309 1.216478
H  -5.695186 -0.667299 -0.084363
H  -4.39913 -1.232164 1.05829
H  -4.46914 -1.901965 -0.611223
H  4.770014 -2.715326 0.011828
H  2.962282 -2.642939 -0.097886
H  3.773099 -2.725511 1.521807
H  2.65501 2.253098 -1.208002
H  4.324927 1.523257 -1.102025
H  4.006467 3.165908 -0.408157
