program: Gaussian 09
title: 000266302
version: EM64L-G09RevD.01
frameworkgroup: C1[X(C17H20N4)]
method: RPBEPBE
basis: SDD
operation: Freq
keyword: #pfreq=noraman
keyword: PBEPBE/SDD
title: #p freq=noraman PBEPBE/SDD
converged: YES YES NO NO
title: Mulliken charges:
elementType: N N N N C C C C C C C C C C C C C C C C C H H H H H H H H H H H H H H H H H H H H
charge: 0.049339 0.049364 -0.447544 -0.447461 -0.395656 -0.414276 -0.414462 -0.264559 -0.264767 0.457453 0.457028 -0.421241 -0.421364 -0.361093 -0.362122 -0.192620 -0.192646 -0.189852 -0.188004 -0.282871 -0.282875 0.202402 0.202087 0.200851 0.235389 0.200265 0.234403 0.200350 0.200707 0.262047 0.262008 0.212981 0.212907 0.280450 0.280974 0.219792 0.219774 0.226304 0.226388 0.225089 0.225064
chargesum: 0.00000
title: Mulliken charges with hydrogens summed into heavy atoms:
elementType: N N N N C C C C C C C C C C C C C C C C C
charge: 0.049339 0.049364 -0.185497 -0.185453 0.008833 0.021964 0.020205 -0.064209 -0.064060 0.457453 0.457028 -0.208260 -0.208457 -0.080643 -0.081148 0.027172 0.027128 0.036453 0.038384 -0.057783 -0.057811
polarizability: 2.28808541e+02 6.34396126e+00 3.50365378e+02 4.01523331e+01 -2.05537028e+00 1.16955827e+02
1716.lowfreq: -5.5096 -1.5454 -0.0003 0.0004 0.0005 4.1922 18.9401 20.4950 34.9449
frequency: 18.0811 20.3692 34.9383 36.0318 60.5255 77.0199 82.8661 109.3811 119.7722 170.5117 207.7876 221.6315 223.9536 250.8896 275.1832 310.6864 312.4966 326.1210 339.7623 408.3108 411.4003 431.3381 493.7490 506.8746 510.7528 523.9109 534.6704 565.0355 566.4375 613.4301 614.4930 616.9222 624.1332 695.1929 697.4031 757.9193 759.0758 797.5781 811.1337 828.5066 835.7519 837.7820 845.2997 883.9389 891.3824 893.9361 895.6110 902.3014 962.1447 964.3317 980.3845 980.5864 985.8304 994.7370 996.0441 1018.1762 1019.4654 1041.7171 1060.5315 1076.6381 1078.0259 1103.2736 1112.9146 1129.5555 1166.9198 1168.5408 1175.8980 1177.8367 1183.3588 1202.9603 1258.7684 1273.4794 1277.5123 1287.4879 1295.6135 1310.3930 1323.0982 1332.6981 1346.9972 1347.8599 1390.4744 1390.7982 1439.4087 1440.1769 1450.3074 1452.0606 1465.0584 1482.2002 1483.6558 1519.7466 1522.4263 1595.3858 1595.6828 1606.5892 1607.2350 1617.4986 1619.9187 2943.3838 2944.9932 2962.0548 2969.1015 2981.2379 3023.5003 3061.0434 3062.1413 3107.9141 3108.2302 3126.7831 3127.9932 3138.3482 3139.0852 3161.2850 3161.6905 3182.0519 3183.7304 3395.2355 3395.4227
redmass: 4.2139 5.2563 4.9407 4.4172 4.1115 4.6885 5.8280 3.7082 3.2426 2.1626 2.8828 4.3616 5.0263 3.0412 4.6908 2.7015 3.1713 4.6950 3.7240 2.9238 2.9788 2.5907 2.4249 2.8037 2.8012 3.5419 4.4429 1.2658 1.2577 6.3424 6.4467 5.4292 5.5240 1.9308 1.9543 1.7195 1.7166 1.6940 2.6347 1.2615 1.2709 2.7563 3.4076 1.8220 1.6328 1.7172 1.4577 1.4202 1.3522 1.3393 5.0205 5.7102 1.3621 1.3357 2.3109 2.2034 2.1233 1.8120 2.8545 2.2576 1.7561 2.2914 2.9773 1.9087 1.0558 1.0523 1.1469 1.1133 1.3706 1.4319 1.1907 2.0355 2.0630 1.3434 1.3223 1.4605 1.3116 1.3742 1.4269 1.4089 5.8907 5.8224 2.1564 2.1941 1.1319 1.1197 1.0931 2.2150 2.1632 2.0342 2.1015 5.2750 5.2101 6.6021 6.5845 6.2492 6.1683 1.0849 1.0848 1.0617 1.0654 1.0646 1.1019 1.0956 1.0959 1.0875 1.0875 1.0866 1.0866 1.0932 1.0932 1.0988 1.0988 1.0951 1.0951 1.0745 1.0745
irintensity: 0.4030 0.1127 0.0506 0.6614 0.0034 1.1317 0.0230 2.3990 0.1087 31.8737 1.9248 12.2149 0.5543 12.4572 1.9102 8.2784 14.1340 4.7906 8.3144 0.0961 0.1053 1.5423 2.9411 46.6995 0.1357 0.0740 0.3436 50.3709 56.5713 0.4479 0.0084 2.9617 23.4959 98.2243 0.5006 168.6422 0.3064 26.2404 2.8450 2.1849 0.5570 10.9491 1.0453 28.7642 24.7755 1.0744 16.2674 0.2164 0.1171 0.0035 0.6963 3.5776 3.4640 0.4931 2.8317 0.1092 6.1525 20.8009 0.4448 7.9046 42.1819 28.7022 181.1019 8.4639 2.9950 0.5433 1.0752 24.8634 3.3638 30.3741 0.0195 9.2442 192.7441 5.7702 0.4158 0.9686 10.7689 20.3159 0.0335 0.1022 26.4521 7.3362 0.6235 8.4013 2.6125 25.2334 14.1621 12.8283 120.3414 13.3116 201.3702 58.2820 41.6946 18.8032 77.4454 6.4855 268.6374 62.4062 57.6037 4.4829 52.8052 131.3616 36.5954 22.3706 43.4473 13.7062 17.6066 2.0824 0.0871 70.6543 4.2478 18.0583 43.6023 3.7585 1.1707 4.2301 2.8625
temp: 298.150 k
press: 1.00000 atm
elementType: 7 7 7 7 6 6 6 6 6 6 6 6 6 6 6 6 6 6 6 6 6 1 1 1 1 1 1 1 1 1 1 1 1 1 1 1 1 1 1 1 1
symmnumber: 1
zpe: 881886.5 jmol-1
zpe.correction: 0.335893 hartree
zpe.thermalcorrener: 0.355618 hartree
zpe.thermalcorrenthalpy: 0.356562 hartree
zpe.thermalcorrgfe: 0.284733 hartree
zpe.sumelectzpe: -877.222772 hartree
zpe.sumelectthermal: -877.203047 hartree
zpe.sumelectthermalent: -877.202103 hartree
zpe.sumelectthermalfe: -877.273932 hartree
dipole: 0.2068 4.0269 -0.0068
dipole: 4.0322
quadrupole: -104.7668 -104.5573 -131.3093
quadrupole: 0.0705 11.4427 -0.5839
quadrupole: 8.7777 8.9872 -17.7649 0.0705 11.4427 -0.5839
hfenergy: -877.5586652 hartree
pointgroup: C01 [X(C17H20N4)]
dipole: -0.6503762 -1.4469425 -0.0007907 debye
polarizability: 247.0599085|46.6081487|329.7339741|-39.6240858|17.4979544|119.335863 unknown
InChI: InChI=1S/C17H20N4/c1-4-10-16(11-5-1)20-18-14-8-3-9-15-19-21-17-12-6-2-7-13-17/h1-2,4-7,10-15,20-21H,3,8-9H2
charge 0 multiplicity 1
41 atoms
N  1.108684 -2.235296 0.498849
N  -2.429407 -0.699212 -0.505446
N  2.354933 -2.047929 -0.052226
N  -3.123946 0.358773 0.032666
C  -1.850034 -4.155741 0.018549
C  -0.802723 -3.663986 1.057269
C  -2.215411 -3.080366 -1.044107
C  0.560818 -3.427434 0.454621
C  -2.955385 -1.901314 -0.460162
C  2.951605 -0.769902 -0.061173
C  -2.564963 1.653774 0.043887
C  4.254522 -0.623479 -0.610688
C  -3.329952 2.72756 0.575442
C  2.27431 0.364915 0.461552
C  -1.258083 1.898304 -0.457727
C  4.871288 0.644932 -0.633026
C  -2.791806 4.031249 0.600816
C  2.90685 1.624295 0.432297
C  -0.737387 3.207949 -0.426205
C  4.205241 1.778797 -0.111111
C  -1.493227 4.28379 0.099428
H  -2.766523 -4.472674 0.556444
H  -1.463952 -5.056302 -0.500745
H  -0.72282 -4.423267 1.862917
H  -1.144413 -2.721618 1.521835
H  -2.840686 -3.557258 -1.827081
H  -1.298199 -2.706124 -1.533404
H  1.064219 -4.294892 -0.025649
H  -3.942499 -2.100045 0.011587
H  2.865673 -2.833719 -0.479586
H  -4.055831 0.220391 0.449089
H  4.781632 -1.4976 -1.015403
H  -4.340337 2.54285 0.963825
H  1.272307 0.239091 0.878821
H  -0.679016 1.063299 -0.859543
H  5.876458 0.745246 -1.058496
H  -3.391526 4.851305 1.012226
H  2.377076 2.492602 0.841451
H  0.270538 3.386436 -0.81902
H  4.687818 2.761636 -0.128131
H  -1.07915 5.297365 0.118459
