program: Gaussian 09
title: 000266295
version: EM64L-G09RevD.01
frameworkgroup: C1[X(C8H2Cl4O2)]
method: RPBEPBE
basis: SDD
operation: Freq
keyword: #p
keyword: freq=noraman
keyword: PBEPBE/SDD
title: #p freq=noraman PBEPBE/SDD
converged: YES YES NO NO
title: Mulliken charges:
elementType: Cl Cl Cl Cl O O C C C C C C C C H H
charge: 0.035577 0.035575 0.094868 0.094853 -0.146518 -0.146515 0.698940 0.698925 -0.349788 -0.349748 -0.357044 -0.357037 -0.181067 -0.181058 0.205024 0.205015
chargesum: 0.00000
title: Mulliken charges with hydrogens summed into heavy atoms:
elementType: Cl Cl Cl Cl O O C C C C C C C C
charge: 0.035577 0.035575 0.094868 0.094853 -0.146518 -0.146515 0.698940 0.698925 -0.349788 -0.349748 -0.357044 -0.357037 0.023956 0.023957
polarizability: 1.87069979e+02 7.07600134e-04 1.85324840e+02 -4.37488789e-05 1.09756877e-01 4.71306884e+01
1716.lowfreq: -5.5694 -0.0018 -0.0002 0.0023 0.3181 6.6710 27.4668 36.1348 53.6548
frequency: 27.4466 36.1290 53.6547 61.3365 78.3109 169.5168 192.5007 224.9089 230.8003 244.4348 256.6249 305.5633 308.8834 323.8023 348.7054 353.2256 357.9132 457.2801 548.1196 585.5908 626.0384 658.5248 703.7854 796.2277 814.0197 818.1629 959.9556 974.6558 979.6642 1088.9621 1174.7766 1294.3298 1329.5186 1329.6361 1402.5079 1425.2541 1498.5977 1535.2740 1619.8998 1623.3297 2974.8577 2975.6240
redmass: 10.2668 5.0916 30.7706 3.3987 4.7180 6.8923 13.7284 21.0069 30.3155 8.8359 20.3000 28.8412 16.2053 6.0303 13.0129 16.0822 13.5932 9.8427 8.2201 6.3531 12.0498 11.4524 10.9468 11.3675 6.4728 8.3558 7.5427 1.8746 2.0803 9.7492 11.3279 10.5667 6.1520 11.7063 1.2793 1.2990 6.2760 10.9732 8.3282 8.9267 1.0862 1.0863
irintensity: 14.5994 0.1768 0.0306 13.6339 0.1390 2.4735 0.3058 2.4261 0.1388 6.7181 0.2070 0.2259 0.0269 0.0357 0.8332 0.1268 0.7966 30.6455 43.5093 0.6421 0.0009 0.6838 51.1277 11.9356 2.2103 53.9633 1.2740 7.6496 1.2507 227.1210 0.0027 309.8964 0.7171 114.8307 0.8430 0.0168 52.8521 0.0036 280.1112 57.3623 46.5635 28.5506
temp: 298.150 k
press: 1.00000 atm
elementType: 17 17 17 17 8 8 6 6 6 6 6 6 6 6 1 1
symmnumber: 1
zpe: 201979.6 jmol-1
zpe.correction: 0.076930 hartree
zpe.thermalcorrener: 0.090863 hartree
zpe.thermalcorrenthalpy: 0.091807 hartree
zpe.thermalcorrgfe: 0.032945 hartree
zpe.sumelectzpe: -2295.692203 hartree
zpe.sumelectthermal: -2295.678270 hartree
zpe.sumelectthermalent: -2295.677326 hartree
zpe.sumelectthermalfe: -2295.736188 hartree
dipole: 2.7843 -0.0019 0.0000
dipole: 2.7843
quadrupole: -107.6638 -122.7948 -105.3142
quadrupole: -0.0086 0.0017 2.9155
quadrupole: 4.2604 -10.8705 6.6101 -0.0086 0.0017 2.9155
hfenergy: -2295.7691332 hartree
pointgroup: C01 [X(C8H2Cl4O2)]
dipole: -0.0002206 -1.0954171 0.0000151 debye
dipolederiv: -0.1701334 -0.3324333 -0.0099931 -0.2575304 -0.5709203 -0.016487 -0.0119429 -0.0296773 0.0025418 -0.1701063 0.3324021 -0.0100062 0.2575089 -0.5709127 0.0165153 -0.0119625 0.0297308 0.0025348 -0.0764139 0.2782851 -0.015335 0.2467524 -0.5530251 0.0235335 -0.024876 0.0385932 0.0284754 -0.0764631 -0.2783072 -0.0153374 -0.2467874 -0.5530229 -0.0235353 -0.0248816 -0.038604 0.0284734 -0.9448975 0.1082459 -0.0286982 0.4113222 -0.360397 -0.0075729 0.0142176 -0.0419814 -0.2860163 -0.9450017 -0.1081703 -0.0286817 -0.4112543 -0.3603316 0.0075903 0.0142201 0.0419819 -0.2860279 -0.9395066 -0.0593798 -0.0881528 -0.1223945 -0.2745494 -0.0309634 -0.1480718 -0.019387 0.1057881 -0.9394537 0.0594669 -0.0881455 0.1225389 -0.2745671 0.0309984 -0.1481031 0.0194307 0.1057772 0.2906011 0.8211686 0.0272469 0.3965521 0.684155 0.0177291 0.0026201 0.0427144 -0.0694647 0.2904775 -0.8211494 0.027276 -0.3965442 0.6841617 -0.0177792 0.0026624 -0.0427786 -0.069464 0.2125818 -0.8051697 0.0180262 -0.373405 0.6748694 -0.0441321 0.0594733 -0.0871104 -0.0507257 0.2126686 0.8052015 0.0180285 0.3734389 0.674866 0.0441418 0.059511 0.0871212 -0.0507051 1.6064457 -0.0350613 0.1092797 -0.1466919 0.4782865 0.1237404 0.1250778 0.1074639 0.1658966 1.6064906 0.0349274 0.1092401 0.146536 0.4782191 -0.1237967 0.125068 -0.1075129 0.1659143 0.0213345 -0.0192122 -0.0123831 -0.1252513 -0.0784262 -0.0718075 -0.0165116 -0.0363474 0.1035047 0.0213765 0.0191856 -0.0123643 0.1252095 -0.0784055 0.0718253 -0.0165007 0.0363628 0.1034975 unknown
polarizability: 184.5412525|-0.0014427|187.0699775|10.3771567|-0.0018346|47.9142769 unknown
InChI: InChI=1S/C8H2Cl4O2/c9-5-3(1-13)6(10)8(12)4(2-14)7(5)11/h1-2H
charge 0 multiplicity 1
16 atoms
Cl -1.569709 -2.851889 -0.124263
Cl 1.569549 -2.851967 0.124418
Cl -1.560621 2.760919 -0.144242
Cl 1.560801 2.760846 0.144275
O  -3.739568 0.838106 -0.161751
O  3.739817 0.837472 0.161785
C  -1.438562 -0.039453 -0.12893
C  1.438584 -0.039584 0.128929
C  -0.700313 -1.256234 -0.065853
C  0.700223 -1.256283 0.065886
C  -0.706609 1.180173 -0.060718
C  0.706743 1.180124 0.060712
C  -2.938384 -0.11443 -0.29311
C  2.938392 -0.114862 0.293132
H  -3.300151 -1.132119 -0.551722
H  3.299906 -1.132619 0.551851
