program: Gaussian 09
title: 000266292
version: EM64L-G09RevD.01
frameworkgroup: C1[X(C14H11N3O3)]
method: RPBEPBE
basis: SDD
operation: Freq
keyword: #p
keyword: freq=noraman
keyword: PBEPBE/SDD
title: #p freq=noraman PBEPBE/SDD
converged: NO YES NO YES
title: Mulliken charges:
elementType: O O O N N N C C C C C C C C C C C C C C H H H H H H H H H H H
charge: -0.222530 -0.219993 -0.205527 -0.426075 0.015852 0.019366 0.504898 0.471928 -0.396962 -0.339299 0.387273 -0.340006 -0.336439 -0.374687 -0.361545 0.390167 -0.359843 -0.366717 -0.396009 -0.203958 0.231911 0.277529 0.287764 0.286876 0.229762 0.264391 0.275601 0.238289 0.285201 0.213411 0.169371
chargesum: 0.00000
title: Mulliken charges with hydrogens summed into heavy atoms:
elementType: O O O N N N C C C C C C C C C C C C C C
charge: -0.222530 -0.219993 -0.205527 -0.140874 0.015852 0.019366 0.504898 0.471928 -0.165051 -0.061770 0.387273 -0.052241 -0.049564 -0.144925 -0.097154 0.390167 -0.084241 -0.128428 -0.182598 -0.034588
polarizability: 5.73179156e+02 1.11924839e+00 1.95160904e+02 -1.82545440e-02 -1.18565204e-02 6.80602291e+01
1716.lowfreq: -9.8233 -0.0015 -0.0009 0.0013 2.1720 3.2234 24.7176 32.6781 34.5419
frequency: 24.5251 32.6618 34.5372 60.6840 77.3526 115.6520 123.8733 160.8719 170.7074 217.9311 229.5194 244.8766 253.0342 302.0030 363.2497 364.8980 383.4050 411.2552 419.0702 464.9192 498.3994 506.6537 522.4990 560.5152 620.5327 627.5866 632.7845 657.7438 664.9745 665.3584 733.4280 737.1239 764.8900 798.6613 827.7720 836.0214 843.4967 856.9745 862.8252 894.9146 927.6297 972.4098 979.6180 993.2232 996.8181 1000.2940 1004.9916 1005.2485 1091.0903 1097.0899 1114.6426 1127.7322 1170.7863 1175.5114 1218.8794 1223.6519 1241.6594 1284.9769 1290.4751 1307.8857 1330.3895 1355.5380 1365.9705 1400.1933 1413.6713 1423.0834 1440.6104 1485.4204 1497.8826 1534.3812 1543.1817 1574.8080 1601.1374 1602.7894 1616.9422 1625.5404 2877.0789 2983.0347 3124.6297 3126.1481 3131.5497 3158.2709 3167.9993 3177.3134 3186.4884 3197.0825 3383.7626
redmass: 5.2329 5.3848 8.1841 8.8570 6.6278 6.9163 7.7905 4.6160 9.9155 2.8131 6.6481 6.7255 3.5732 5.1437 3.5809 7.8186 5.6502 2.8439 3.0163 6.7869 2.9833 7.9169 2.5662 6.8763 6.9073 7.1256 1.2828 7.4224 6.3242 4.7440 4.7145 3.2742 7.3217 5.4797 1.3274 5.5802 1.4238 1.2750 1.5385 4.1399 1.5325 1.5509 1.3345 2.9627 1.3932 1.3332 1.5795 2.7752 3.2683 2.8972 1.3207 1.7022 1.3573 1.2045 2.6971 3.8409 2.1461 1.5813 1.7404 1.4796 1.9339 5.6150 1.9642 2.0459 3.8504 4.3886 4.5890 2.3718 2.6101 2.7666 5.0707 6.2223 5.0863 5.8390 6.2945 6.6712 1.0850 1.0870 1.0895 1.0889 1.0906 1.0955 1.0950 1.0891 1.0945 1.0964 1.0748
irintensity: 2.5162 0.0095 3.1568 0.0142 0.2164 4.2759 2.5900 2.9493 4.0291 26.3504 4.0226 0.1777 11.7968 0.6898 3.7250 9.9793 13.7668 1.0266 0.0006 1.2350 24.8839 8.4759 15.8344 13.7751 0.3066 1.5523 64.2152 3.5079 4.7996 25.5706 3.4831 2.7678 49.5707 23.6500 22.0266 29.8070 26.3521 0.7997 78.6152 4.5877 41.9225 15.0795 1.1009 2.4308 0.0465 0.0478 3.1945 1.2039 169.1221 62.0085 17.0060 194.0090 289.8321 27.4069 586.7102 425.4052 12.6768 155.3244 97.4303 6.8449 55.3468 47.3257 18.7425 47.0391 33.7351 14.9201 15.3118 86.2351 6.9584 613.9589 150.4186 19.4224 45.2620 472.0796 330.2065 34.5062 144.6465 52.5776 18.4353 1.3913 10.3412 6.9332 2.3625 0.8687 1.5611 1.5438 4.6115
temp: 298.150 k
press: 1.00000 atm
elementType: 8 8 8 7 7 7 6 6 6 6 6 6 6 6 6 6 6 6 6 6 1 1 1 1 1 1 1 1 1 1 1
symmnumber: 1
zpe: 592855.5 jmol-1
zpe.correction: 0.225807 hartree
zpe.thermalcorrener: 0.242817 hartree
zpe.thermalcorrenthalpy: 0.243762 hartree
zpe.thermalcorrgfe: 0.178565 hartree
zpe.sumelectzpe: -928.507976 hartree
zpe.sumelectthermal: -928.490965 hartree
zpe.sumelectthermalent: -928.490021 hartree
zpe.sumelectthermalfe: -928.555217 hartree
dipole: -2.4600 4.4353 0.0008
dipole: 5.0718
quadrupole: -206.9767 -96.1573 -119.1256
quadrupole: 14.3363 -0.0012 -0.0042
quadrupole: -66.2235 44.5959 21.6276 14.3363 -0.0012 -0.0042
hfenergy: -928.7337824 hartree
pointgroup: C01 [X(C14H11N3O3)]
dipole: 0.9658739 -1.7460766 0.000313 debye
polarizability: 573.181198|0.6933754|195.1588624|0.0182679|0.0118359|68.0602291 unknown
InChI: InChI=1S/C14H11N3O3/c18-10-12-3-1-11(2-4-12)9-15-16-13-5-7-14(8-6-13)17(19)20/h1-10,16H
charge 0 multiplicity 1
31 atoms
O  -7.011206 0.11853 -0.000545
O  -6.065814 2.198688 -0.000337
O  7.698994 0.782527 -0.000297
N  -0.829336 -1.476421 -0.000163
N  0.321327 -0.733192 0.00008
N  -5.983018 0.906496 -0.000349
C  -2.089206 -0.863574 -0.000172
C  2.750141 -0.661734 0.000135
C  -3.249718 -1.690532 -0.000374
C  -2.222825 0.554405 -0.000001
C  -4.643308 0.297177 -0.00023
C  -4.526921 -1.112479 -0.000396
C  -3.500139 1.131851 -0.000036
C  3.963906 -1.413506 0.000002
C  2.817355 0.763486 0.000315
C  5.270493 0.65487 0.000237
C  5.20808 -0.765206 0.000054
C  4.063196 1.40874 0.000365
C  1.475365 -1.378364 0.00007
C  6.576048 1.357097 0.000308
H  -3.146479 -2.782266 -0.000486
H  -1.321932 1.171039 0.000179
H  -5.432768 -1.723792 -0.000525
H  -3.634289 2.216675 0.000084
H  3.917683 -2.509436 -0.000138
H  1.88452 1.334868 0.00042
H  6.148021 -1.327528 -0.000041
H  4.114394 2.504787 0.000507
H  -0.786617 -2.506949 -0.000286
H  1.523248 -2.485961 -0.000155
H  6.507801 2.474604 -0.000023
