program: Gaussian 09
title: 000266291
version: EM64L-G09RevD.01
frameworkgroup: C1[X(C14H12N2O)]
method: RPBEPBE
basis: SDD
operation: Freq
keyword: #p
keyword: freq=noraman
keyword: PBEPBE/SDD
title: #p freq=noraman PBEPBE/SDD
converged: NO YES NO NO
title: Mulliken charges:
elementType: O N N C C C C C C C C C C C C C C H H H H H H H H H H H H
charge: -0.215612 -0.431295 0.017495 0.474216 -0.381036 -0.369019 0.388707 0.477743 -0.363367 -0.369937 -0.411346 -0.415059 -0.362622 -0.189866 -0.189678 -0.261408 -0.210518 0.226364 0.263188 0.271518 0.233285 0.208643 0.218682 0.266845 0.275778 0.226683 0.226901 0.230797 0.163920
chargesum: 0.00000
title: Mulliken charges with hydrogens summed into heavy atoms:
elementType: O N N C C C C C C C C C C C C C C
charge: -0.215612 -0.155517 0.017495 0.474216 -0.154671 -0.105831 0.388707 0.477743 -0.091850 -0.136653 -0.202703 -0.196377 -0.095777 0.036817 0.037223 -0.030611 -0.046598
polarizability: 4.75044984e+02 -2.66331836e+00 1.69976427e+02 -3.45797292e-03 3.44128178e-03 6.36879816e+01
1716.lowfreq: -8.6667 -6.5791 -0.0010 -0.0006 0.0007 3.7314 32.9296 35.3380 42.5668
frequency: 32.9202 35.3353 42.5655 79.5591 143.6224 147.4331 195.0077 206.6675 239.6876 252.9987 261.8099 359.1570 375.2995 406.7926 413.7829 428.8425 506.1159 522.7496 528.9574 612.6682 621.1824 621.3635 634.5493 661.7962 693.8535 738.2778 761.1163 786.6621 832.1496 832.5213 842.8002 855.3479 893.1086 902.0961 914.8961 967.4171 970.3008 982.6142 989.9750 995.2622 1003.0891 1003.2744 1019.9670 1077.5150 1109.1679 1136.1449 1170.6624 1173.3237 1179.2773 1223.1521 1240.8641 1275.1720 1300.7557 1309.3535 1343.3625 1363.8927 1392.5510 1402.0866 1425.5309 1443.3864 1483.4321 1495.8947 1532.4591 1537.3598 1571.7004 1599.7210 1604.5411 1615.0753 1623.3341 2866.8384 2978.8796 3113.9497 3119.8825 3122.2954 3133.9830 3145.6725 3155.8276 3165.9957 3166.7224 3183.6699 3379.1576
redmass: 4.4216 4.6449 5.8949 6.7273 6.4414 5.0167 6.8341 2.7127 3.7837 5.5463 3.4199 3.5549 5.4453 2.9022 2.8631 6.1033 2.8638 2.5528 7.1610 6.4261 6.7631 1.2737 6.5265 6.2483 1.9203 3.2762 1.7172 4.7284 5.3238 1.2589 1.4198 1.2674 4.1021 1.4459 1.5460 1.3624 1.5347 6.0345 1.3141 1.3897 1.5693 2.7788 2.1457 1.7683 1.5662 2.7930 1.0671 1.1731 1.1086 2.2748 2.1934 2.1777 1.5400 1.3942 1.7342 1.8158 3.5632 2.3300 4.6072 2.2967 2.3042 2.5669 2.7278 4.1974 6.1256 6.2278 4.5531 6.0400 6.6000 1.0846 1.0866 1.0882 1.0893 1.0887 1.0867 1.0931 1.0953 1.0948 1.0983 1.0960 1.0743
irintensity: 0.9739 0.0335 0.8650 1.6702 7.1774 2.8739 1.2359 22.2515 19.2734 3.4380 1.5829 3.3040 16.4198 0.0247 1.1166 1.1232 27.4616 15.1146 4.7226 2.7838 7.9754 53.4655 34.5252 3.9553 50.2749 1.5585 84.9330 33.4871 20.5966 0.6002 31.8467 3.1958 2.7387 13.2174 49.6860 0.2305 12.1558 1.2849 1.5013 0.0039 3.0611 0.0171 2.1423 38.1771 51.3331 177.1705 9.3153 92.5908 3.7397 109.4074 56.9843 151.2694 4.2213 27.0449 31.4617 15.1042 30.7837 1.9791 14.4201 9.3736 191.8488 12.0140 860.9921 214.3716 75.3151 408.9938 10.5292 79.5442 9.9562 152.8333 55.0258 13.8232 18.7609 4.6670 1.1527 27.4778 8.4871 4.0877 39.1556 4.3616 9.0390
temp: 298.150 k
press: 1.00000 atm
elementType: 8 7 7 6 6 6 6 6 6 6 6 6 6 6 6 6 6 1 1 1 1 1 1 1 1 1 1 1 1
symmnumber: 1
zpe: 589030.3 jmol-1
zpe.correction: 0.224350 hartree
zpe.thermalcorrener: 0.238733 hartree
zpe.thermalcorrenthalpy: 0.239677 hartree
zpe.thermalcorrgfe: 0.181252 hartree
zpe.sumelectzpe: -724.202593 hartree
zpe.sumelectthermal: -724.188210 hartree
zpe.sumelectthermalent: -724.187266 hartree
zpe.sumelectthermalfe: -724.245691 hartree
dipole: 5.7277 -1.5488 -0.0004
dipole: 5.9334
quadrupole: -128.1103 -79.2182 -105.9348
quadrupole: -5.6814 0.0040 0.0009
quadrupole: -23.6892 25.2029 -1.5137 -5.6814 0.0040 0.0009
hfenergy: -724.426943 hartree
pointgroup: C01 [X(C14H12N2O1)]
dipole: -2.2504094 -0.620446 0.0001618 debye
polarizability: 475.011376|4.1647234|170.0100348|-0.003441|-0.0034583|63.6879816 unknown
InChI: InChI=1S/C14H12N2O/c17-11-13-8-6-12(7-9-13)10-15-16-14-4-2-1-3-5-14/h1-11,16H
charge 0 multiplicity 1
29 atoms
O  6.649283 0.37232 -0.000419
N  -2.051846 -1.107419 0.000127
N  -0.840309 -0.487009 0.00012
C  1.584588 -0.637347 0.000099
C  2.73036 -1.491539 0.000151
C  1.780968 0.777304 -0.000019
C  4.216939 0.453942 -0.000019
C  -3.258699 -0.372269 0.000054
C  4.026449 -0.955707 0.000093
C  3.078395 1.309871 -0.000076
C  0.252469 -1.235889 0.000165
C  -4.486568 -1.086452 -0.000055
C  -3.261306 1.047471 0.000108
C  -5.707826 -0.38178 -0.000103
C  -4.491159 1.735457 0.000052
C  -5.720178 1.032613 -0.00005
C  5.575456 1.038111 -0.000071
H  2.587604 -2.57935 0.000242
H  0.901452 1.42794 -0.000064
H  4.912731 -1.599616 0.000136
H  3.225871 2.397548 -0.000166
H  0.197619 -2.343245 0.00019
H  -4.485494 -2.18421 -0.000109
H  -2.307852 1.581056 0.000185
H  -2.112503 -2.137188 0.000122
H  -6.650609 -0.939783 -0.000187
H  -4.490014 2.831235 0.000092
H  -6.669946 1.577085 -0.000087
H  5.602124 2.158152 -0.000512
