program: Gaussian 09
title: 000024784
version: EM64L-G09RevD.01
frameworkgroup: C1[X(C10H12FNO)]
method: RPBEPBE
basis: SDD
operation: Freq
keyword: #p
keyword: freq=noraman
keyword: PBEPBE/SDD
title: #p freq=noraman PBEPBE/SDD
converged: YES YES NO NO
title: Mulliken charges:
elementType: F O N C C C C C C C C C C H H H H H H H H H H H H
charge: -0.205795 -0.220779 -0.237361 0.466139 -0.525516 0.468462 -0.341930 -0.417555 -0.215738 -0.673966 0.159093 -0.811726 -0.299989 0.239063 0.281948 0.233889 0.239837 0.236764 0.262756 0.227347 0.220902 0.238987 0.226040 0.229389 0.219740
chargesum: 0.00000
title: Mulliken charges with hydrogens summed into heavy atoms:
elementType: F O N C C C C C C C C C C
charge: -0.205795 -0.220779 -0.237361 0.466139 -0.286452 0.468462 -0.059982 -0.183666 0.011610 0.065390 0.159093 -0.125797 0.149140
polarizability: 1.66083142e+02 6.75658555e-01 1.22811703e+02 -4.03933719e+00 3.83264684e+00 6.76336953e+01
1716.lowfreq: -29.0237 -11.0133 -7.2450 -0.0006 -0.0004 0.0009 5.8603 33.5106 50.9510
frequency: -28.4439 33.4633 50.9043 102.9950 133.3085 164.9663 180.5903 205.2807 238.5353 284.5119 301.8920 334.1634 376.7835 418.8519 440.3741 512.4483 527.8990 563.3225 591.0125 623.6301 696.8605 707.8655 788.2607 811.1061 874.2442 904.1642 915.2840 979.4732 988.0618 996.9590 1000.0272 1011.8223 1046.8341 1084.7808 1098.8616 1105.4392 1116.5431 1188.0652 1198.9518 1207.6439 1249.8910 1308.8621 1316.7251 1357.7642 1380.6073 1397.5604 1431.4970 1442.1109 1444.6971 1472.2626 1473.9026 1483.5690 1487.0744 1495.0763 1593.4571 1614.6865 1624.5663 2974.9918 2975.8856 2985.6638 3054.5736 3056.6861 3073.6340 3085.2592 3111.0582 3126.6567 3133.8453 3151.5318 3205.8796
redmass: 1.0176 4.0991 9.4034 4.0061 2.7464 2.5598 1.4980 3.0749 3.3395 5.5504 4.1817 8.3650 2.6000 3.5752 2.8874 4.6233 3.9106 4.2607 4.3756 5.2160 2.0566 5.7801 1.6821 3.7592 1.3468 1.4985 2.7045 1.3504 5.8954 1.8246 1.8635 3.5754 1.5540 2.9283 1.6502 1.5409 1.5772 1.0990 2.1345 1.0742 4.0751 2.3246 1.3437 1.7928 7.9141 1.2255 2.2366 1.0929 1.1920 1.0539 1.3465 1.0575 1.8551 1.1110 6.0151 6.4857 9.3546 1.0424 1.0385 1.0554 1.1074 1.0958 1.0922 1.0995 1.1003 1.0877 1.0907 1.0958 1.0949
irintensity: 0.6203 4.2163 1.2662 5.6029 7.3736 0.5701 1.4139 3.2489 2.4590 1.0267 1.5447 2.7316 0.9223 0.2592 5.3379 0.7534 1.9911 2.2959 2.7548 8.6594 25.4711 2.2887 43.6103 8.5361 10.3124 4.8286 3.5361 0.2280 0.3054 3.8447 14.4636 147.4793 16.6964 5.6730 39.9961 28.5944 2.2605 2.2732 8.6203 0.2996 31.7079 145.8464 9.4325 53.0145 1.0746 11.3227 12.7695 10.6699 3.7048 12.8084 12.2686 30.2507 90.3219 18.1846 34.2616 97.1740 169.2416 36.8489 40.1244 29.3379 23.6287 22.5769 21.7919 18.5523 19.4950 8.5614 16.7630 21.9390 0.5484
temp: 298.150 k
press: 1.00000 atm
elementType: 9 8 7 6 6 6 6 6 6 6 6 6 6 1 1 1 1 1 1 1 1 1 1 1 1
symmnumber: 1
zpe: 522266.6 jmol-1
zpe.correction: 0.198921 hartree
zpe.thermalcorrener: 0.211196 hartree
zpe.thermalcorrenthalpy: 0.212140 hartree
zpe.thermalcorrgfe: 0.159584 hartree
zpe.sumelectzpe: -617.107154 hartree
zpe.sumelectthermal: -617.094879 hartree
zpe.sumelectthermalent: -617.093935 hartree
zpe.sumelectthermalfe: -617.146491 hartree
dipole: 2.8854 -5.0230 2.0243
dipole: 6.1363
quadrupole: -80.7098 -70.8755 -78.3115
quadrupole: 11.3374 -7.4380 2.9256
quadrupole: -4.0776 5.7568 -1.6793 11.3374 -7.4380 2.9256
hfenergy: -617.3060748 hartree
pointgroup: C01 [X(C10H12F1N1O1)]
dipole: -1.1448156 -1.9847049 -0.7607082 debye
dipolederiv: -0.6879676 -0.1252167 -0.1065086 -0.2522623 -0.3006529 -0.0617731 -0.1727943 -0.0428691 -0.2873285 -0.6303222 0.0190773 -0.0072201 -0.4475341 -0.8776715 -0.2588577 -0.2066491 -0.1877788 -0.3981014 -1.5071644 -0.1619077 -0.1523466 -0.1071442 -0.5940332 -0.0743376 -0.2190404 -0.1915449 -0.3124734 1.0071887 -0.2278544 -0.0529118 -0.4865458 0.142164 -0.0959582 -0.030885 -0.0427361 0.0856504 -0.3561396 -0.0503143 0.0195167 -0.0756226 -0.0145866 -0.0257798 0.0093922 -0.0459595 -0.1967381 0.2497479 0.1326703 -0.0815967 0.213187 0.1445102 -0.0806595 -0.1795854 -0.0996525 0.0273614 -0.1673381 0.0706261 -0.0066698 0.2536709 -0.143541 -0.0220526 0.0601088 -0.0016867 -0.1498342 -0.0854155 -0.0680986 -0.007012 -0.182025 -0.1471607 0.0222972 0.0401072 0.0131017 -0.1971062 0.1036106 -0.0364743 -0.017552 -0.0212885 0.1515898 -0.0771264 -0.001657 -0.0425969 -0.115056 0.0042491 0.0058944 -0.0288349 -0.1088462 0.4437538 -0.0045164 0.0425949 -0.0076918 0.2259139 1.4770788 0.2220807 0.2181561 0.7893176 0.9615967 0.393162 0.3281606 0.3387428 0.3022484 -0.0321246 -0.0798725 0.0410118 -0.0815563 0.0097183 0.035849 0.1209295 0.079495 0.0235582 0.5279957 0.2444963 0.1204017 0.4089296 0.291814 0.0210915 0.2281615 -0.0043489 0.4353325 0.1033085 0.0354036 -0.0058208 0.0496148 -0.091347 0.0550021 -0.0110803 0.0595662 0.1361807 0.0537491 -0.0633688 0.035805 -0.0554213 0.0831279 0.0324217 0.0291094 0.0057206 0.1478625 -0.1160391 0.0747018 0.0130264 0.0562879 0.0723105 0.0118494 0.0103847 0.0058042 0.1558812 0.0995187 -0.0180969 0.0097231 0.0026607 -0.0984099 0.0411139 -0.0075236 0.1319005 -0.0638501 -0.0977756 0.1030652 0.1282116 0.0453591 0.0465283 0.0073983 0.110915 -0.0107099 0.0609093 0.0105566 -0.0970882 -0.1259251 -0.0318057 0.0631621 -0.0027174 -0.0975174 -0.008998 0.0422486 0.0671616 0.0309736 -0.0007861 0.0413819 -0.1044247 0.0630052 -0.0128584 0.0574352 0.1366298 0.0577049 0.0569974 0.0381929 -0.0342475 -0.1305769 -0.056054 -0.0037661 -0.0830795 0.0825385 0.0426819 -0.0441656 0.0220217 -0.0532369 0.0760872 0.0153774 0.0762592 0.0422521 -0.132941 -0.1115757 0.0118182 -0.0530671 0.0965713 0.0501822 0.0508998 -0.0972449 0.021352 0.0774744 -0.0059271 -0.0339181 -0.0007114 -0.0252362 -0.0804262 0.0597046 -0.0162829 0.0984486 0.0232933 -0.0067624 -0.0014285 0.0008958 0.0057917 0.0462854 -0.0493396 0.0007618 -0.0841663 -0.1096542 unknown
polarizability: 166.1160927|-1.0431409|122.6342395|-3.4567705|-4.9945897|67.7782085 unknown
InChI: InChI=1S/C10H12FNO/c1-8-4-3-5-9(6-8)12(2)10(13)7-11/h3-6H,7H2,1-2H3
charge 0 multiplicity 1
25 atoms
F  4.508361 0.206086 0.522646
O  2.085373 1.344283 0.514101
N  0.972288 -0.583559 -0.265602
C  -0.358896 -0.020086 -0.187621
C  -1.448315 -0.860639 0.157938
C  -2.775326 -0.366721 0.202368
C  -0.59878 1.345763 -0.48976
C  -3.001852 0.996519 -0.108454
C  -1.918469 1.838864 -0.444966
C  1.089699 -2.01255 -0.639774
C  2.109918 0.149507 0.119313
C  -3.921856 -1.276892 0.611375
C  3.445777 -0.626661 0.024614
H  -1.271867 -1.91094 0.4173
H  0.230925 2.006331 -0.742675
H  -4.022365 1.396253 -0.08401
H  1.058001 -2.685367 0.23947
H  2.026388 -2.198417 -1.189239
H  0.259273 -2.276445 -1.313058
H  -2.101382 2.892291 -0.684152
H  -3.769275 -2.312101 0.257043
H  -4.021842 -1.318367 1.713438
H  -4.884367 -0.917114 0.208089
H  3.430172 -1.547252 0.637676
H  3.687517 -0.876888 -1.026961
