program: Gaussian 09
title: 000266288
version: EM64L-G09RevD.01
frameworkgroup: C1[X(C12H19NO)]
method: RPBEPBE
basis: SDD
operation: Freq
keyword: #p
keyword: freq=noraman
keyword: PBEPBE/SDD
title: #p freq=noraman PBEPBE/SDD
converged: YES YES NO NO
title: Mulliken charges:
elementType: O N C C C C C C C C C C C C H H H H H H H H H H H H H H H H H H H
charge: -0.302099 -0.164304 0.007720 -0.422621 -0.436481 -0.394175 -0.395904 -0.389470 -0.542330 0.226948 0.012678 -0.185878 -0.577612 -0.526690 0.180043 0.255633 0.189090 0.190517 0.261697 0.200778 0.184499 0.184170 0.201192 0.195124 0.202429 0.239696 0.237454 0.227665 0.235781 0.223421 0.213726 0.216954 0.250350
chargesum: 0.00000
title: Mulliken charges with hydrogens summed into heavy atoms:
elementType: O N C C C C C C C C C C C C
charge: -0.302099 -0.164304 0.187762 0.022102 0.015734 -0.008898 -0.010543 0.008083 -0.065180 0.226948 0.240343 0.049904 -0.140465 -0.059387
polarizability: 1.73246209e+02 3.63590780e+00 1.42415661e+02 -1.33511612e+00 -6.51921031e-01 1.01749069e+02
1716.lowfreq: -5.1208 -0.0003 -0.0002 0.0006 8.0799 19.9565 38.6004 49.4251 65.4096
frequency: 38.4960 49.3541 64.9540 89.0123 96.0428 108.3317 149.4982 197.5853 222.8039 249.7528 281.2690 286.5776 332.8393 356.9831 400.1660 413.2410 445.7556 458.3499 479.3886 523.9896 568.1729 595.6903 678.4110 751.8844 778.6481 787.7444 804.9372 844.4570 887.1667 895.6202 904.5980 920.1034 932.8380 948.5168 967.5674 981.7775 997.8785 1000.9258 1035.4899 1046.9317 1054.6881 1057.4640 1071.5588 1110.9243 1116.0065 1135.7634 1174.1073 1190.9566 1208.8800 1246.8135 1256.0744 1262.1574 1279.6602 1291.4579 1304.5022 1319.9670 1326.1265 1329.4206 1335.2768 1339.9347 1343.6870 1353.3233 1395.3048 1426.1747 1427.8233 1463.6634 1463.9952 1470.7755 1471.5668 1484.3589 1489.2987 1554.1230 1640.3347 1654.6347 2956.5913 2957.6911 2961.4025 2974.8777 2985.7253 2987.1649 2991.2786 3025.4110 3029.2874 3039.2674 3056.4266 3064.1714 3073.1688 3084.6705 3097.2807 3105.6410 3144.7519 3196.2026 3214.5378
redmass: 3.2605 3.6056 3.8454 3.2025 2.3482 2.7743 3.3455 3.0814 1.7954 3.6453 2.5809 3.1682 1.8692 3.7725 2.6546 2.8402 3.2245 2.9414 1.7097 1.9935 1.6928 2.6793 2.6724 2.6440 3.5078 1.4438 2.5653 2.0430 1.7677 1.5600 1.5793 1.8019 2.2307 1.4299 1.8674 1.4134 1.0893 1.1944 2.7157 1.7821 1.1569 1.7143 1.3560 2.5143 2.3991 2.5222 3.0609 1.6045 1.5959 1.3038 1.2857 1.4094 1.2471 1.3500 1.3060 1.3560 1.2275 1.3498 1.3667 1.4584 1.5243 1.6261 1.2276 1.6925 1.1906 1.0869 1.0887 1.0858 1.0876 1.0898 1.1251 7.6533 4.6300 4.6317 1.0642 1.0659 1.0811 1.0617 1.0647 1.0647 1.0652 1.0972 1.0938 1.1038 1.0960 1.0996 1.0986 1.0606 1.0589 1.0946 1.0940 1.1139 1.1157
irintensity: 0.0539 0.1774 2.3722 0.9244 0.6493 2.3437 1.2056 1.1406 0.0489 0.8112 1.6777 4.9399 1.5201 7.0087 5.1115 3.9061 3.9573 0.9729 3.0191 2.0459 1.4922 3.1151 15.2611 5.6794 21.8553 0.4460 4.1067 6.2984 4.1082 13.6162 8.9232 0.2011 6.0133 67.9761 28.2641 23.0795 35.8870 34.9563 1.6492 0.2007 1.6515 13.6271 0.4953 0.2865 32.0240 32.8902 15.5310 1.3838 70.4507 0.1807 0.7086 3.9300 0.7467 22.6075 0.2874 14.5448 8.7664 3.0977 0.3464 1.1137 29.1757 47.4513 25.6521 95.3704 12.9142 6.8574 4.3934 12.2999 11.8315 6.6478 18.7636 173.9153 18.0663 10.0951 19.1789 42.0700 39.8773 32.9905 12.4296 73.5091 34.4209 69.4772 56.1087 54.2724 10.5638 11.0732 38.6265 13.2237 6.9953 9.0402 13.7229 23.7397 9.1547
temp: 298.150 k
press: 1.00000 atm
elementType: 8 7 6 6 6 6 6 6 6 6 6 6 6 6 1 1 1 1 1 1 1 1 1 1 1 1 1 1 1 1 1 1 1
symmnumber: 1
zpe: 751076.0 jmol-1
zpe.correction: 0.286070 hartree
zpe.thermalcorrener: 0.300838 hartree
zpe.thermalcorrenthalpy: 0.301782 hartree
zpe.thermalcorrgfe: 0.243745 hartree
zpe.sumelectzpe: -597.517425 hartree
zpe.sumelectthermal: -597.502656 hartree
zpe.sumelectthermalent: -597.501712 hartree
zpe.sumelectthermalfe: -597.559749 hartree
dipole: 1.0702 -3.1590 1.0929
dipole: 3.5098
quadrupole: -76.5072 -89.2891 -86.3988
quadrupole: 0.5945 1.1776 1.6807
quadrupole: 7.5578 -5.2241 -2.3337 0.5945 1.1776 1.6807
hfenergy: -597.8034944 hartree
pointgroup: C01 [X(C12H19N1O1)]
dipole: -0.1884851 1.2610152 0.5301964 debye
polarizability: 173.5612874|-2.0600839|141.8176659|0.6123501|3.5115778|102.0319855 unknown
InChI: InChI=1S/C12H19NO/c1-3-10-13(12(14)4-2)11-8-6-5-7-9-11/h3-4,11H,1-2,5-10H2
charge 0 multiplicity 1
33 atoms
O  -0.626904 -1.93816 -0.498686
N  -0.509837 0.246292 0.323121
C  0.984925 0.284781 0.209647
C  1.669649 -0.696207 1.198634
C  1.495271 0.075793 -1.239367
C  3.209022 -0.553577 1.131331
C  3.035687 0.222335 -1.293454
C  3.729615 -0.753454 -0.312543
C  -1.157046 1.406513 0.992587
C  -1.219469 -0.881057 -0.095567
C  -1.587953 2.498847 0.026968
C  -2.721234 -0.800479 -0.070826
C  -2.797043 3.111649 0.050808
C  -3.470574 -1.914737 -0.271304
H  1.274191 1.315466 0.507372
H  1.368401 -1.724855 0.932061
H  1.308565 -0.498403 2.227442
H  1.011525 0.811953 -1.911208
H  1.198179 -0.930696 -1.581214
H  3.681015 -1.28539 1.814909
H  3.506699 0.45545 1.488393
H  3.32444 1.263803 -1.036028
H  3.387422 0.040898 -2.327343
H  4.827601 -0.613314 -0.346292
H  3.52478 -1.795488 -0.63151
H  -2.013721 1.073183 1.603524
H  -0.416426 1.820484 1.705178
H  -0.840209 2.787688 -0.725966
H  -3.205022 0.173493 0.060574
H  -3.053774 3.906013 -0.65831
H  -3.566451 2.841178 0.786219
H  -4.565267 -1.877415 -0.289143
H  -2.977754 -2.880689 -0.432004
