program: Gaussian 09
title: 000266285
version: EM64L-G09RevD.01
frameworkgroup: C1[X(C9H9FN2O6)]
method: RPBEPBE
basis: SDD
operation: Freq
keyword: #p
keyword: freq=noraman
keyword: PBEPBE/SDD
title: #p freq=noraman PBEPBE/SDD
converged: YES YES NO NO
title: Mulliken charges:
elementType: F O O O O O O N N C C C C C C C C C H H H H H H H H H
charge: -0.166462 -0.230404 -0.457119 -0.412040 -0.204033 -0.252674 -0.218250 -0.176835 -0.414133 -0.044603 -0.510946 -0.132576 -0.150178 0.179749 0.241873 -0.177115 0.163215 0.111439 0.298375 0.276880 0.278296 0.250834 0.285458 0.360455 0.344383 0.368355 0.388054
chargesum: 0.00000
title: Mulliken charges with hydrogens summed into heavy atoms:
elementType: F O O O O O O N N C C C C C C C C C
charge: -0.166462 -0.230404 -0.096664 -0.023986 -0.204033 -0.252674 -0.218250 -0.176835 -0.045778 0.253772 0.044230 0.118257 0.135280 0.179749 0.241873 0.167268 0.163215 0.111439
polarizability: 1.86673961e+02 -4.10133375e+00 1.29649564e+02 4.23190397e+00 -7.74748198e+00 7.70546612e+01
1716.lowfreq: -16.4457 -5.9862 -1.9874 -0.0009 0.0004 0.0005 27.7091 34.9281 52.8575
frequency: 27.5549 34.5266 52.8334 55.0320 105.5423 119.5306 158.2804 165.0219 182.7963 240.1003 260.5969 287.6670 306.3096 326.8237 341.0174 362.6030 379.7356 384.9481 418.5888 456.9100 483.0126 534.7390 598.1573 603.1409 623.8177 672.2939 687.3164 695.3666 709.7776 717.8910 744.0648 774.1632 785.1460 806.2048 872.9178 886.1254 889.7931 927.7867 937.4897 951.8043 1009.2734 1028.3678 1040.7621 1068.4228 1114.5053 1130.8016 1154.9081 1173.5819 1207.6630 1225.1344 1241.6518 1270.1404 1273.1173 1301.7059 1314.0801 1334.4337 1339.1866 1362.5179 1368.3621 1384.7575 1427.8109 1449.6477 1633.9120 1648.2588 1666.0866 1675.3076 3021.3778 3054.9579 3084.8300 3091.4226 3123.4379 3126.0316 3508.0921 3523.3687 3572.2249
redmass: 10.3971 7.6989 8.3023 8.4256 10.1421 8.3520 5.4474 7.0070 5.5513 7.9652 7.1039 14.8307 5.3161 1.2188 6.4270 4.3575 8.6088 4.2731 3.4249 9.2897 5.5002 6.3895 1.6682 4.1398 4.1923 4.6893 2.2760 3.6652 5.8575 8.6975 8.1407 2.1936 6.0417 3.1420 4.5906 4.9192 3.7656 2.6713 1.4167 2.8041 4.9611 2.4720 3.4528 2.5775 2.5857 5.7677 1.2138 1.5270 4.5861 1.4044 1.3760 1.7035 1.8084 1.4097 1.4190 2.3118 1.7085 1.6639 1.5151 1.7776 2.0459 1.1020 5.6513 12.2683 8.9623 6.3028 1.0860 1.0625 1.0875 1.0880 1.1037 1.0976 1.0642 1.0770 1.0664
irintensity: 0.9175 0.0371 0.3933 1.1163 0.9130 2.5262 3.5670 2.4569 5.6432 3.1076 4.2017 2.0325 9.1280 122.2833 22.1901 15.5188 15.5754 5.8205 40.9162 3.8794 11.2130 13.1817 77.8236 48.8641 21.6883 38.1294 26.3180 38.7074 5.8148 15.7938 3.9316 124.7091 7.7344 6.0482 29.1347 28.0274 7.2425 25.7047 25.5496 77.1903 388.3870 161.5674 24.1646 27.8345 56.4940 52.1552 55.7503 30.2789 22.1440 31.4450 57.2852 122.9979 188.8102 26.3798 6.6017 46.4077 22.5046 27.2121 13.4064 4.0980 47.0938 20.9855 303.9529 215.3444 218.2529 458.2036 34.2187 6.8821 7.5724 4.0383 1.5397 107.0143 36.9390 67.0564 15.8621
temp: 298.150 k
press: 1.00000 atm
elementType: 9 8 8 8 8 8 8 7 7 6 6 6 6 6 6 6 6 6 1 1 1 1 1 1 1 1 1
symmnumber: 1
zpe: 493564.7 jmol-1
zpe.correction: 0.187989 hartree
zpe.thermalcorrener: 0.204114 hartree
zpe.thermalcorrenthalpy: 0.205058 hartree
zpe.thermalcorrgfe: 0.142781 hartree
zpe.sumelectzpe: -1007.713166 hartree
zpe.sumelectthermal: -1007.697042 hartree
zpe.sumelectthermalent: -1007.696097 hartree
zpe.sumelectthermalfe: -1007.758374 hartree
dipole: 8.1183 2.7789 1.6902
dipole: 8.7456
quadrupole: -105.4997 -110.3420 -101.3710
quadrupole: 16.0985 -2.7906 0.8948
quadrupole: 0.2379 -4.6045 4.3666 16.0985 -2.7906 0.8948
hfenergy: -1007.9011551 hartree
pointgroup: C01 [X(C9H9F1N2O6)]
dipole: -3.3354322 0.0487993 0.8435492 debye
polarizability: 184.6756346|-5.7142365|102.5048339|10.3774451|-28.3912913|106.1977174 unknown
InChI: InChI=1S/C9H9FN2O6/c10-3-2-12(9(17)11-7(3)14)5-1-4(13)6(18-5)8(15)16/h2,4-6,11,13,15H,1H2
charge 0 multiplicity 1
27 atoms
F  2.754495 -1.703463 2.165563
O  -1.240354 -0.48782 -0.826512
O  -1.683841 -0.721123 2.173214
O  -4.824864 -0.65908 -0.926376
O  -3.525607 1.141576 -1.634165
O  1.550318 1.871788 -1.858346
O  4.797617 -0.546612 0.4957
N  0.825097 0.471762 -0.094538
N  3.123064 0.639149 -0.640423
C  -0.586342 0.777525 -0.377807
C  -1.419629 1.283122 0.835542
C  -2.376637 0.129748 1.198032
C  -2.539887 -0.604244 -0.171322
C  -3.636216 0.070945 -1.003377
C  1.813987 1.052828 -0.939206
C  1.156439 -0.439732 0.912431
C  2.453943 -0.798527 1.147018
C  3.576656 -0.275131 0.36084
H  -0.580755 1.489656 -1.217108
H  -1.997674 2.168824 0.529302
H  -0.791573 1.55024 1.699043
H  -3.342673 0.481219 1.607064
H  -2.76787 -1.675871 -0.058568
H  -2.274442 -1.455968 2.475592
H  0.322224 -0.838073 1.501323
H  3.85345 1.048883 -1.232311
H  -5.541725 -0.204119 -1.447406
