program: Gaussian 09
title: 000266280
version: EM64L-G09RevD.01
frameworkgroup: C1[X(C10H11ClN2)]
method: RPBEPBE
basis: SDD
operation: Freq
keyword: #p
keyword: freq=noraman
keyword: PBEPBE/SDD
title: #p freq=noraman PBEPBE/SDD
converged: YES YES NO NO
title: Mulliken charges:
elementType: Cl N N C C C C C C C C C C H H H H H H H H H H H
charge: -0.080383 -0.438044 -0.060142 0.312265 -0.026305 0.389423 0.362608 -0.573973 -0.551233 0.287367 -0.820279 -0.820585 -0.745342 0.240831 0.255055 0.317998 0.227168 0.229941 0.228143 0.236219 0.223347 0.224510 0.304355 0.277055
chargesum: 0.00000
title: Mulliken charges with hydrogens summed into heavy atoms:
elementType: Cl N N C C C C C C C C C C
charge: -0.080383 -0.120046 -0.060142 0.312265 -0.026305 0.389423 0.362608 -0.333143 -0.296177 0.287367 -0.135027 -0.136509 -0.163931
polarizability: 2.22787109e+02 -1.51791612e+00 1.22246803e+02 4.39225414e+00 3.19216673e-01 7.34684482e+01
1716.lowfreq: -3.0058 -0.0018 -0.0011 0.0008 10.1942 12.3248 35.6925 65.8309 120.2594
frequency: 35.6486 65.8077 120.2283 137.8368 148.0608 180.5056 215.5317 264.1218 302.2304 331.1955 357.8093 380.0980 433.6354 446.2463 455.3156 564.1052 588.6227 603.1635 653.6719 688.2917 717.2601 733.6876 772.2681 773.8189 858.4329 864.4916 892.9682 904.8454 977.8193 1003.9510 1006.1843 1032.0886 1053.4169 1099.9230 1126.4393 1168.0760 1212.6518 1232.4320 1249.3933 1259.1077 1308.0409 1376.3150 1389.4638 1396.3543 1409.9665 1437.1441 1446.6540 1460.0753 1462.4030 1476.4116 1480.6612 1493.6567 1524.0375 1584.0982 1648.7094 2968.8249 2969.6354 3039.6253 3042.8187 3070.3324 3081.5082 3086.1472 3135.3517 3152.4855 3169.2089 3592.3989
redmass: 5.8589 6.6514 1.4239 3.6373 1.8372 1.1632 3.0766 4.3033 2.5312 3.9872 3.1420 4.8679 3.1429 3.9962 5.9784 3.4184 4.4384 1.2991 3.8572 5.0080 6.5623 4.5413 5.2712 3.9567 1.4617 3.0134 1.4644 1.6720 5.3230 1.4061 1.5325 1.4400 1.6286 2.4084 1.4696 1.7489 3.8152 1.6428 1.2514 1.4722 6.2324 5.0053 3.5493 1.2364 1.3056 1.4156 1.4511 2.6311 1.0470 1.0458 1.2260 1.8165 4.2629 7.8827 7.5210 1.0381 1.0381 1.0970 1.0969 1.0604 1.0985 1.0975 1.0924 1.0926 1.1073 1.0814
irintensity: 2.8694 3.7597 0.9897 4.0722 4.5930 0.2729 8.8532 3.7858 0.0352 4.3344 0.8185 2.0726 9.4004 3.4781 12.7491 3.1369 57.2110 110.5847 4.3210 44.6239 4.9332 6.4590 0.0313 0.3839 30.4744 7.3670 11.3625 4.3720 4.7139 31.1169 2.4446 17.8574 0.0408 5.4435 6.9609 0.0808 1.5118 48.2747 49.9356 18.1805 20.0213 39.5541 1.3400 7.6041 16.6260 14.4219 13.2616 10.0698 0.1772 31.4667 6.6753 12.0712 2.9197 16.1874 6.5569 62.2950 26.6985 39.2566 5.5640 15.3716 33.3844 9.9213 13.9757 6.6662 0.8311 53.8413
temp: 298.150 k
press: 1.00000 atm
elementType: 17 7 7 6 6 6 6 6 6 6 6 6 6 1 1 1 1 1 1 1 1 1 1 1
symmnumber: 1
zpe: 497130.4 jmol-1
zpe.correction: 0.189347 hartree
zpe.thermalcorrener: 0.201496 hartree
zpe.thermalcorrenthalpy: 0.202440 hartree
zpe.thermalcorrgfe: 0.150225 hartree
zpe.sumelectzpe: -956.311384 hartree
zpe.sumelectthermal: -956.299235 hartree
zpe.sumelectthermalent: -956.298291 hartree
zpe.sumelectthermalfe: -956.350506 hartree
dipole: 2.1750 2.5196 -1.6620
dipole: 3.7204
quadrupole: -79.6761 -79.5900 -85.5775
quadrupole: -0.9715 7.9700 -1.5645
quadrupole: 1.9384 2.0245 -3.9629 -0.9715 7.9700 -1.5645
hfenergy: -956.5007307 hartree
pointgroup: C01 [X(C10H11Cl1N2)]
dipole: -0.9184248 1.002041 0.543 debye
dipolederiv: -0.7537002 -0.0706421 0.1060245 -0.3587635 -0.248788 0.1151567 0.6167778 0.114531 -0.3769141 -0.4917287 0.0569702 -0.0484305 -0.1644909 -0.5122192 -0.0370604 -0.1044768 -0.0447704 -0.2548752 -0.1835274 -0.147461 -0.0010384 0.0997976 -0.4058769 -0.0038745 0.1328438 0.0077712 -0.2648083 0.2842596 0.1193445 0.0660239 0.2046283 -0.0524658 0.0452347 0.0174018 0.0248329 0.0714939 0.0424818 0.053333 0.0334787 -0.0377039 -0.0373856 -0.0201805 -0.0287496 -0.0060195 0.0308364 0.1551417 -0.105312 0.0331601 -0.3870572 0.1218663 -0.020413 0.0354608 -0.0170954 -0.0393171 0.0755582 0.1907725 0.0163417 0.4980474 -0.0251856 0.0168094 0.0023952 0.018304 -0.0710489 -0.0853368 -0.0526211 -0.0014949 -0.0674039 0.030452 -0.0058192 0.025692 -0.0148411 -0.2102022 0.1351069 -0.0618922 0.0071538 0.0774719 0.0932468 -0.0139647 0.0046605 -0.013446 -0.1550212 -0.3358693 -0.1124984 -0.0009574 -0.1417881 0.6646308 0.0560897 -0.1276591 0.0172567 -0.0375913 -0.1427169 0.0859713 -0.0198418 0.0168839 0.056509 0.0046217 -0.0264973 0.008569 0.0628729 -0.0985512 -0.0842901 -0.0121067 -0.0323773 0.0476026 -0.0038659 -0.01211 -0.0067661 0.0756262 1.1076686 0.1889718 -0.2083052 0.3252772 0.2280086 -0.1642565 -0.6042454 -0.1677931 0.4890699 0.0605623 0.0074706 -0.0094829 0.0237691 -0.1054565 0.0085397 -0.0106464 0.0115357 0.1702146 0.0876947 -0.0081914 -0.0061224 -0.0275656 -0.0743213 0.0085192 -0.0064694 0.0068076 0.1559954 0.1997956 0.0125196 -0.0142813 0.0249075 0.1885174 0.0220916 -0.0011194 0.0395293 0.3402274 -0.0745379 0.016121 0.0872327 -0.0032307 0.0806527 0.0704808 0.1401852 0.0261335 -0.0279608 0.0757746 -0.0909872 -0.0002406 0.0436059 -0.1548501 0.0113327 -0.0041232 0.0008048 0.1079432 -0.0318825 0.0153676 -0.0846543 0.0023461 0.0730794 -0.0813687 -0.1402883 -0.0319029 -0.06124 0.0795529 0.0930363 -0.007605 -0.0382795 -0.1443335 0.009203 -0.0009312 0.0201146 0.1081824 -0.0815337 -0.0154301 0.0907815 0.0249896 0.0714343 -0.0784593 0.1401984 -0.0325592 -0.0239204 -0.0341039 -0.0285725 -0.0856299 -0.0012502 0.0803475 0.0702452 -0.1428257 0.0169094 -0.0754248 0.0826407 -0.0233966 0.0423545 0.0658369 -0.0140173 0.0458863 0.0288439 0.0407103 0.0597132 -0.0727491 -0.0385835 0.0176397 -0.1476507 0.0385523 -0.0549482 0.0656823 -0.0186161 -0.0738512 unknown
polarizability: 222.0046825|9.6740764|122.1792179|-0.2219811|-6.893385|74.31846 unknown
InChI: InChI=1S/C10H11ClN2/c1-6-3-8-9(4-7(6)2)13-10(5-11)12-8/h3-4,12H,5H2,1-2H3
charge 0 multiplicity 1
24 atoms
Cl 4.609025 0.795009 -0.964212
N  1.495532 1.110787 0.247981
N  1.502398 -1.174401 0.305332
C  0.153796 0.727136 0.125723
C  0.175921 -0.70693 0.176551
C  -2.255012 0.720493 -0.106714
C  -2.250532 -0.723759 -0.051071
C  -1.047913 1.448854 -0.018474
C  -1.036938 -1.427586 0.090415
C  2.261048 -0.061726 0.346155
C  -3.568871 1.466092 -0.260724
C  -3.559468 -1.489112 -0.14731
C  3.73178 -0.059734 0.516168
H  -1.063296 2.543406 -0.060079
H  -1.023531 -2.521362 0.13121
H  1.871331 2.05521 0.177469
H  -4.263615 1.243401 0.571971
H  -3.411932 2.557869 -0.285053
H  -4.091961 1.179849 -1.193513
H  -3.388107 -2.576697 -0.082813
H  -4.259163 -1.209966 0.664164
H  -4.083581 -1.28765 -1.101723
H  4.109197 -1.088958 0.542799
H  4.082193 0.521876 1.38145
