program: Gaussian 09
title: 000024771
version: EM64L-G09RevD.01
frameworkgroup: C1[X(C2H6OSi)]
method: RPBEPBE
basis: SDD
operation: Freq
keyword: #p
keyword: freq=noraman
keyword: PBEPBE/SDD
title: #p freq=noraman PBEPBE/SDD
converged: YES YES NO NO
title: Mulliken charges:
elementType: Si O C C H H H H H H
charge: 1.129133 -0.625927 -1.053717 -1.053718 0.260278 0.281647 0.260190 0.260253 0.260214 0.281647
chargesum: 0.00000
title: Mulliken charges with hydrogens summed into heavy atoms:
elementType: Si O C C
charge: 1.129133 -0.625927 -0.251603 -0.251603
polarizability: 5.31910367e+01 3.86514294e-05 5.51463341e+01 5.08978350e-04 6.07993185e-03 3.53728139e+01
1716.lowfreq: -59.9779 -11.9407 -10.4076 0.0009 0.0013 0.0023 9.6350 54.7044 206.2107
frequency: -59.9481 54.7043 206.2107 226.1803 262.2520 594.3634 702.7174 750.0570 829.3997 843.9503 886.3858 1071.4626 1301.8310 1309.6591 1429.9466 1436.2863 1439.8003 1449.7593 2983.7228 2986.3095 3077.7496 3080.0798 3117.1161 3117.2312
redmass: 1.0198 1.0742 2.5330 4.0350 5.0227 4.6013 2.7615 1.1667 1.6758 1.3356 1.4710 8.7045 1.1935 1.1745 1.0490 1.0589 1.0457 1.0490 1.0352 1.0351 1.0968 1.0971 1.0985 1.0982
irintensity: 0.0000 0.1572 0.0392 10.2529 28.4442 2.1565 21.1194 0.0002 100.6779 34.9177 18.7745 91.7055 51.4602 33.1752 5.2547 0.0009 14.3475 37.9020 4.0265 4.5438 0.0012 13.1134 4.3784 3.7345
temp: 298.150 k
press: 1.00000 atm
elementType: 14 8 6 6 1 1 1 1 1 1
symmnumber: 1
zpe: 198323.9 jmol-1
zpe.correction: 0.075538 hartree
zpe.thermalcorrener: 0.081374 hartree
zpe.thermalcorrenthalpy: 0.082318 hartree
zpe.thermalcorrgfe: 0.046076 hartree
zpe.sumelectzpe: -444.091606 hartree
zpe.sumelectthermal: -444.085769 hartree
zpe.sumelectthermalent: -444.084825 hartree
zpe.sumelectthermalfe: -444.121067 hartree
dipole: 0.0000 -4.7677 -0.0020
dipole: 4.7677
quadrupole: -30.3844 -40.5513 -30.0551
quadrupole: -0.0001 0.0003 -0.0027
quadrupole: 3.2792 -6.8877 3.6086 -0.0001 0.0003 -0.0027
hfenergy: -444.1671437 hartree
pointgroup: C01 [X(C2H6O1Si1)]
dipole: -0.0005098 1.8130207 -0.4811031 debye
dipolederiv: 1.4851748 0.0001144 -0.0000105 0.0001115 1.0403837 -0.1139287 -0.0000189 -0.1138373 0.6444617 -0.7490609 -0.0000502 0.0000061 -0.0000508 -0.5637161 0.0045374 0.000006 0.003868 -0.5503462 -0.523349 0.096818 -0.0259159 0.1005534 -0.3906951 0.0653257 -0.0273483 0.0656418 -0.1630316 -0.5232396 -0.0968816 0.0259207 -0.1006143 -0.3907549 0.0654063 0.0273598 0.065767 -0.1630814 0.1090412 0.020619 -0.0184684 0.0256038 -0.0156964 -0.0996475 0.0101887 -0.1023092 0.0465351 -0.0627129 -0.0956042 0.0253633 -0.0575273 0.0813787 0.0124951 0.0150829 0.0124588 0.1256106 0.108926 0.0270266 0.0062469 0.016947 0.0867089 0.0765031 -0.0210673 0.079175 -0.0561641 0.1090638 -0.0205122 0.0185742 -0.0254833 -0.0159308 -0.0996067 -0.0100899 -0.102294 0.0466876 0.1089546 -0.0270217 -0.0062278 -0.0169586 0.0868252 0.0763608 0.0210844 0.0790386 -0.0562495 -0.0627981 0.0954919 -0.0254887 0.0574186 0.0814967 0.0125546 -0.0151974 0.0124913 0.1255778 unknown
polarizability: 53.1910369|-0.0005691|53.8445471|0.0000301|-4.9037023|36.6746007 unknown
InChI: InChI=1S/C2H6OSi/c1-4(2)3/h1-2H3
charge 0 multiplicity 1
10 atoms
Si 0.000007 -0.167505 0.089101
O  0.000447 -1.730318 0.503077
C  -1.59088 0.838534 -0.179455
C  1.590329 0.839386 -0.179601
H  -1.638914 1.699131 0.513834
H  -2.474781 0.201837 -0.011303
H  -1.636983 1.240201 -1.2092
H  1.637512 1.700567 0.51302
H  1.636578 1.240262 -1.20965
H  2.474586 0.203403 -0.010622
