program: Gaussian 09
title: 000266278
version: EM64L-G09RevD.01
frameworkgroup: C1[X(C11H13NO4)]
method: RPBEPBE
basis: SDD
operation: Freq
keyword: #p
keyword: freq=noraman
keyword: PBEPBE/SDD
title: #p freq=noraman PBEPBE/SDD
converged: YES YES NO NO
title: Mulliken charges:
elementType: O O O O N C C C C C C C C C C C H H H H H H H H H H H H H
charge: -0.241850 -0.270071 -0.429629 -0.261946 -0.009634 0.301716 0.191775 -0.398004 0.151301 -0.712188 -0.701431 0.140829 0.040963 -0.469081 -0.751595 0.095745 0.239302 0.271576 0.222867 0.251683 0.221303 0.235053 0.239814 0.239859 0.286716 0.235833 0.242354 0.249997 0.386746
chargesum: 0.00000
title: Mulliken charges with hydrogens summed into heavy atoms:
elementType: O O O O N C C C C C C C C C C C
charge: -0.241850 -0.270071 -0.042884 -0.261946 -0.009634 0.301716 0.191775 0.112873 0.151301 -0.016336 0.013295 0.140829 0.040963 -0.182365 -0.023411 0.095745
polarizability: 1.83889031e+02 7.57748855e+00 1.58335875e+02 -3.81309663e-01 2.22919519e-01 8.14606399e+01
1716.lowfreq: -13.8654 -7.5177 -1.6503 -0.0006 -0.0003 0.0005 45.6314 74.1173 82.3600
frequency: 45.5214 74.0830 82.3544 95.7431 106.4611 161.9804 166.8330 198.9453 217.4737 235.6387 274.7676 283.5840 296.7629 312.5920 341.4219 374.0241 395.5721 445.3141 478.7341 502.4132 518.2900 529.2383 537.1692 571.3750 602.8108 631.7752 655.8541 718.1491 724.0400 739.7902 758.9134 771.3757 903.3239 923.5633 926.2539 930.1917 941.7389 979.7284 995.3266 1001.2914 1035.5737 1041.4261 1080.6887 1126.7508 1192.1657 1197.9550 1206.3537 1222.4902 1261.3634 1276.2174 1323.4297 1333.3154 1336.1956 1376.8684 1384.9021 1392.0243 1396.4164 1433.7052 1441.3617 1451.8229 1453.0559 1459.3315 1465.9631 1469.8316 1481.5761 1541.2532 1560.7082 1624.5171 2988.0735 2990.0291 3000.4115 3013.2196 3062.8459 3098.7823 3101.8471 3106.0614 3117.5051 3125.2273 3126.6837 3173.2958 3529.0164
redmass: 5.8115 4.9136 2.9721 3.1316 1.2436 3.8173 1.1434 1.6005 2.5587 2.3788 2.9231 2.7793 3.2788 4.1638 5.6450 4.2792 2.9122 4.6404 4.3728 3.4004 3.4149 3.8831 5.1290 5.3365 1.4262 4.8758 5.0838 5.7625 7.0794 4.4042 4.3154 5.2832 3.5300 2.9694 1.5540 1.4727 2.7851 2.0686 3.4369 1.5161 2.5553 1.5793 2.6742 1.9461 2.7500 2.3925 1.2169 3.0122 2.9964 3.4023 2.1385 2.5588 2.4130 1.7967 2.3072 1.2642 1.2596 1.4965 1.2690 1.0552 1.0473 1.0711 1.5080 1.0792 1.0647 6.6162 7.7242 8.2809 1.0378 1.0680 1.0365 1.0356 1.0958 1.0986 1.0950 1.0999 1.1001 1.1006 1.0997 1.0923 1.0642
irintensity: 1.1195 0.8491 0.8553 1.3357 0.2093 1.6629 0.4829 0.8070 0.4048 0.2064 3.1537 9.8329 0.0508 1.9856 4.1494 1.7246 1.6991 5.2800 0.3725 0.7319 23.8009 44.9360 12.0848 23.4379 101.4202 16.3836 46.9108 15.8085 19.1100 2.1751 8.3780 49.7277 40.9152 26.2149 7.5994 1.6431 90.2887 77.2665 17.1631 10.2733 92.6002 5.6471 95.5318 192.3777 17.9530 98.4244 41.9911 83.4232 0.5644 56.6144 85.6085 23.7759 10.2745 125.1654 102.9602 18.0192 28.7850 40.2435 7.1609 8.9105 13.2090 7.7536 28.6882 3.6208 9.6923 24.2068 34.6062 296.1210 8.6680 16.6113 11.4426 10.2746 12.8310 23.4505 3.0116 5.2621 20.0085 15.4526 10.5219 1.1626 56.1492
temp: 298.150 k
press: 1.00000 atm
elementType: 8 8 8 8 7 6 6 6 6 6 6 6 6 6 6 6 1 1 1 1 1 1 1 1 1 1 1 1 1
symmnumber: 1
zpe: 588865.8 jmol-1
zpe.correction: 0.224287 hartree
zpe.thermalcorrener: 0.239687 hartree
zpe.thermalcorrenthalpy: 0.240631 hartree
zpe.thermalcorrgfe: 0.182167 hartree
zpe.sumelectzpe: -781.433014 hartree
zpe.sumelectthermal: -781.417614 hartree
zpe.sumelectthermalent: -781.416670 hartree
zpe.sumelectthermalfe: -781.475134 hartree
dipole: 1.3104 -1.0537 1.4022
dipole: 2.1894
quadrupole: -79.5380 -102.1702 -93.3260
quadrupole: 4.3628 3.1625 -2.2640
quadrupole: 12.1400 -10.4922 -1.6479 4.3628 3.1625 -2.2640
hfenergy: -781.6573009 hartree
pointgroup: C01 [X(C11H13N1O4)]
dipole: 0.5367433 0.4059584 -0.5376629 debye
polarizability: 183.4291419|-8.2458577|158.7342524|2.3190468|0.7311575|81.5221513 unknown
InChI: InChI=1S/C11H13NO4/c1-6-9-8(5-15-11(2,3)16-9)7(4-12-6)10(13)14/h4,13H,5H2,1-3H3
charge 0 multiplicity 1
29 atoms
O  1.64875 1.682003 0.779751
O  1.986008 -0.631612 0.173196
O  -4.015909 0.632976 -0.060838
O  -2.453239 2.344536 -0.068446
N  -1.226972 -2.382839 -0.090676
C  2.503973 0.783931 0.022489
C  -0.300534 0.322742 0.111814
C  0.250113 1.725409 0.303057
C  0.596464 -0.775867 0.092694
C  3.861124 0.78846 0.711313
C  2.552595 1.112354 -1.480396
C  -1.692338 0.020393 -0.009611
C  0.108857 -2.117737 0.010567
C  -2.096893 -1.335592 -0.111326
C  1.067101 -3.28015 0.035313
C  -2.696931 1.10904 -0.045222
H  0.165291 2.327292 -0.623053
H  -0.296625 2.268619 1.087995
H  4.345934 1.770549 0.58279
H  3.727319 0.594588 1.787225
H  4.506704 0.005658 0.280941
H  2.863167 2.162375 -1.62035
H  3.285448 0.455976 -1.978138
H  1.575639 0.963346 -1.970823
H  -3.157072 -1.580869 -0.210991
H  1.77748 -3.226243 -0.810654
H  1.681288 -3.267047 0.954638
H  0.499118 -4.220769 -0.019083
H  -4.633359 1.41208 -0.097571
