program: Gaussian 09
title: 000266276
version: EM64L-G09RevD.01
frameworkgroup: C1[X(C14H18N3OP)]
method: RPBEPBE
basis: SDD
operation: Freq
keyword: #p
keyword: freq=noraman
keyword: PBEPBE/SDD
title: #p freq=noraman PBEPBE/SDD
converged: YES YES NO NO
title: Mulliken charges:
elementType: P O N N N C C C C C C C C C C C C C C H H H H H H H H H H H H H H H H H H
charge: 1.331694 -0.586570 -0.875605 -0.878390 -0.931201 0.527586 0.519834 -0.414292 -0.417062 -0.358433 -0.356179 0.451733 0.451843 -0.402942 -0.403230 -0.360990 -0.357456 -0.809320 -0.809267 0.353952 0.349518 0.219349 0.217836 0.278935 0.279272 0.356048 0.355472 0.227558 0.227612 0.227730 0.228909 0.225929 0.220492 0.231296 0.227046 0.220284 0.231007
chargesum: 0.00000
title: Mulliken charges with hydrogens summed into heavy atoms:
elementType: P O N N N C C C C C C C C C C C C C C
charge: 1.331694 -0.586570 -0.521653 -0.528872 -0.219682 0.527586 0.519834 -0.194943 -0.199226 -0.079497 -0.076908 0.451733 0.451843 -0.175384 -0.175617 -0.133260 -0.128547 -0.131603 -0.130930
polarizability: 2.75862489e+02 -2.63906881e+00 1.76871635e+02 -1.81227987e+01 -3.49621090e+00 1.55210266e+02
1716.lowfreq: -53.4975 -5.9961 0.0007 0.0016 0.0020 2.2421 9.0604 13.0639 20.8521
frequency: -53.4330 13.0549 20.2405 25.5638 28.2530 44.6613 91.7601 93.6150 123.4735 134.0428 191.1279 202.8686 230.4121 243.5654 273.1806 303.3611 333.9174 341.6975 348.0297 365.5027 387.9760 404.1393 405.5107 424.6995 453.5101 480.2475 511.8029 518.5598 522.7629 545.0042 565.4390 631.5869 634.6933 710.7204 714.0679 720.7199 737.4267 775.7979 801.7574 814.3438 819.2685 823.4600 833.0975 839.7372 879.2193 880.4889 936.4601 937.5307 949.9279 963.4566 966.0397 985.5417 986.8557 1008.4104 1008.5163 1046.1262 1046.8240 1068.9217 1128.2563 1129.1137 1195.7174 1196.8608 1223.7931 1224.1070 1248.6144 1253.8423 1304.5392 1311.0679 1334.8082 1339.0115 1394.1148 1395.7185 1399.7746 1400.7058 1433.2882 1435.7614 1469.9090 1470.4305 1478.4649 1479.2897 1509.8865 1515.4502 1565.1030 1588.5215 1589.7357 1630.2008 1633.0933 2972.7435 2973.0310 3049.8724 3049.9492 3078.6480 3079.2928 3110.6619 3111.1041 3119.9582 3121.7686 3135.5650 3135.9683 3147.3407 3148.9902 3525.2031 3546.8537 3552.1343 3673.1585
redmass: 1.0242 3.8733 1.3996 2.2897 3.4157 4.5903 4.8528 5.1558 4.1346 3.7112 2.7927 4.0355 4.7758 5.2021 3.2735 2.7200 3.3749 3.0874 2.5561 2.7791 3.6902 2.9021 3.0125 4.5400 1.2527 1.3854 2.1579 2.7021 4.1864 3.4771 1.4311 6.9060 6.8096 3.5729 2.9117 3.8312 4.5660 4.9582 4.4256 1.9812 1.5360 2.1330 1.3917 1.6163 5.0055 4.5199 1.3404 1.3483 1.6526 1.3649 1.3578 1.4063 1.4063 2.8605 2.8545 1.5324 1.5308 4.8414 1.2997 1.3022 1.1112 1.1146 2.4229 2.4248 2.2429 2.1429 1.6940 1.6067 1.8979 2.2592 2.0249 1.4838 1.6213 2.2201 2.2049 2.0337 1.0467 1.0464 1.1302 1.1246 2.7737 2.8685 1.1091 5.7825 5.5506 6.3733 6.3667 1.0372 1.0372 1.0976 1.0975 1.0987 1.0986 1.0872 1.0871 1.0889 1.0887 1.0964 1.0963 1.0966 1.0965 1.0445 1.0761 1.0759 1.1019
irintensity: 0.3883 0.4183 0.2995 0.3490 0.0426 3.2598 0.1659 3.6231 8.2417 2.7671 1.7143 0.8585 3.4347 3.0777 1.2927 1.8321 5.0545 0.9395 5.1210 9.1064 17.0121 0.7697 4.4932 42.1093 22.8538 318.4111 40.2142 16.6675 3.4539 71.3429 140.5757 2.1369 23.0464 2.8641 2.6298 2.1440 8.0114 12.0426 39.2732 14.3299 69.8764 84.5154 24.6596 60.6914 102.4174 280.6864 4.0090 5.4460 105.8944 2.8523 2.0883 0.9570 1.5071 10.0079 1.1598 10.6510 10.5761 151.2527 24.8239 18.7801 4.0927 2.3446 0.7651 2.5273 97.3843 19.4785 198.0760 27.1539 141.8358 49.4123 14.2877 0.7230 36.0166 25.3171 23.5896 19.7632 12.3317 12.2544 11.4528 15.1776 348.9023 100.4569 57.0104 3.8102 3.6625 100.7165 24.2108 63.6556 43.0977 23.7996 23.9906 20.3960 20.9681 19.0124 18.3991 21.0644 19.2537 26.6264 24.4933 1.9192 1.0512 40.5763 27.4791 36.0431 35.7130
temp: 298.150 k
press: 1.00000 atm
elementType: 15 8 7 7 7 6 6 6 6 6 6 6 6 6 6 6 6 6 6 1 1 1 1 1 1 1 1 1 1 1 1 1 1 1 1 1 1
symmnumber: 1
zpe: 777335.8 jmol-1
zpe.correction: 0.296072 hartree
zpe.thermalcorrener: 0.315455 hartree
zpe.thermalcorrenthalpy: 0.316399 hartree
zpe.thermalcorrgfe: 0.244721 hartree
zpe.sumelectzpe: -1123.618022 hartree
zpe.sumelectthermal: -1123.598639 hartree
zpe.sumelectthermalent: -1123.597695 hartree
zpe.sumelectthermalfe: -1123.669373 hartree
dipole: -0.3326 0.8503 -4.0088
dipole: 4.1115
quadrupole: -108.0424 -108.2923 -122.0142
quadrupole: -2.3175 -3.8629 -6.9685
quadrupole: 4.7405 4.4907 -9.2312 -2.3175 -3.8629 -6.9685
hfenergy: -1123.9140938 hartree
pointgroup: C01 [X(C14H18N3O1P1)]
dipole: -0.1390335 -0.024549 -1.6114207 debye
polarizability: 275.6667447|-6.7981545|174.3028731|-17.6880442|-7.7886042|157.9747721 unknown
InChI: InChI=1S/C14H18N3OP/c1-11-3-7-13(8-4-11)16-19(15,18)17-14-9-5-12(2)6-10-14/h3-10,16-17H,15H2,1-2H3
charge 0 multiplicity 1
37 atoms
P  -0.011875 1.782826 -0.220202
O  -0.069676 2.075381 1.348065
N  -0.84052 0.355244 -0.79622
N  1.558612 1.513387 -0.936625
N  -0.63318 3.078361 -1.183487
C  -2.145989 -0.081235 -0.434983
C  2.563105 0.616714 -0.476969
C  -2.721677 -1.1797 -1.12476
C  3.76083 0.474874 -1.22454
C  -2.894819 0.557103 0.590464
C  2.394718 -0.15254 0.706237
C  -4.785546 -0.993495 0.215662
C  4.607941 -1.20465 0.373202
C  -4.01972 -1.625587 -0.795255
C  4.764125 -0.421473 -0.797166
C  -4.19332 0.102787 0.895539
C  3.404899 -1.047541 1.110243
C  -6.17996 -1.479534 0.574172
C  5.690276 -2.165889 0.835356
H  -0.283984 -0.2658 -1.388064
H  1.816725 2.179689 -1.667627
H  -2.156604 -1.682724 -1.919827
H  3.906417 1.062425 -2.139941
H  -2.447183 1.375042 1.165513
H  1.498553 -0.022581 1.322744
H  -1.261681 2.879476 -1.961594
H  -0.704046 4.001662 -0.755306
H  -4.443744 -2.478578 -1.339219
H  5.683234 -0.513636 -1.388809
H  -4.754273 0.605484 1.693588
H  3.258527 -1.629253 2.028967
H  -6.919133 -0.657503 0.535765
H  -6.521184 -2.27054 -0.116267
H  -6.211522 -1.895927 1.599391
H  5.298172 -3.194071 0.949859
H  6.528509 -2.204663 0.118075
H  6.104392 -1.866134 1.817024
