program: Gaussian 09
title: 000266275
version: EM64L-G09RevD.01
frameworkgroup: C1[X(C21H22ClN4O4P)]
method: RPBEPBE
basis: SDD
operation: Freq
keyword: #p
keyword: freq=noraman
keyword: PBEPBE/SDD
title: #p freq=noraman PBEPBE/SDD
converged: YES YES NO NO
title: Mulliken charges:
elementType: Cl P O O O O N N N N C C C C C C C C C C C C C C C C C C C C C H H H H H H H H H H H H H H H H H H H H H H
charge: -0.033473 1.361751 -0.602382 -0.316048 -0.340296 -0.281700 -0.811587 -0.921170 -0.783449 -0.462945 0.519818 0.531054 0.366174 0.331558 -0.412501 -0.415804 -0.366526 -0.353569 0.147454 -0.442097 0.491202 -0.283835 -0.195707 -0.194208 -0.216818 -0.215398 -0.362485 -0.258360 -0.262678 -0.527018 -0.517292 0.352673 0.409119 0.346499 0.345934 0.225020 0.229234 0.294754 0.273311 0.329993 0.268971 0.225598 0.223344 0.224933 0.224930 0.227938 0.227048 0.232883 0.230749 0.247282 0.238205 0.229845 0.220074
chargesum: 0.00000
title: Mulliken charges with hydrogens summed into heavy atoms:
elementType: Cl P O O O O N N N N C C C C C C C C C C C C C C C C C C C C C
charge: -0.033473 1.361751 -0.602382 -0.316048 -0.340296 -0.281700 -0.458914 -0.512051 -0.436950 -0.117012 0.519818 0.531054 0.366174 0.331558 -0.187481 -0.186570 -0.071772 -0.080257 0.147454 -0.112104 0.491202 -0.014863 0.029891 0.029136 0.008115 0.009531 -0.362485 -0.030422 -0.035630 0.183896 0.170832
polarizability: 3.86534779e+02 2.80565903e-01 3.56113428e+02 2.34884485e+01 -3.74747556e+01 2.24055462e+02
1716.lowfreq: -6.3428 -4.9340 -1.4664 -0.0024 -0.0021 -0.0020 6.5931 11.5192 17.0819
frequency: 4.4938 11.3689 17.0210 29.2722 32.8793 33.8454 39.5414 58.3577 62.9160 71.4245 87.9454 90.9586 119.1423 129.6350 133.4640 147.5240 154.7056 168.4213 178.8961 187.6320 197.1737 206.1621 228.5363 242.4912 251.3958 261.7302 274.6825 285.7186 300.6753 314.5563 335.5314 343.6070 387.3254 404.5374 407.3412 415.4648 437.3205 447.1686 459.7332 477.8752 498.2346 507.4776 514.7482 526.2271 564.1642 580.5261 590.1922 611.4506 612.7796 614.5963 672.6585 683.0959 695.2697 697.3769 698.9095 705.6688 726.3786 728.7668 732.6651 737.5345 760.2680 764.1948 776.9407 784.7521 827.6882 834.2856 836.4425 839.9229 869.0217 892.8437 903.0925 910.0875 911.0379 924.7418 965.8154 970.3680 982.4930 983.4776 986.3683 990.6242 992.2558 1002.9824 1022.4173 1024.6176 1027.5803 1046.4988 1086.7074 1089.1454 1109.4468 1117.7993 1147.6704 1150.9241 1166.1529 1169.9279 1170.8780 1171.3371 1191.7636 1193.8062 1210.4154 1233.4677 1245.2846 1254.8719 1285.8601 1308.8041 1324.4516 1359.8857 1364.1344 1368.2637 1376.5672 1401.0701 1404.6004 1419.5650 1436.7735 1445.5488 1460.3329 1464.0301 1464.6667 1467.6160 1470.3077 1471.2155 1484.7382 1485.3037 1490.5897 1514.2264 1587.7511 1594.6029 1595.7654 1610.2937 1613.9774 1619.1802 1619.9874 2968.1124 2971.7612 3063.0548 3064.6348 3118.1148 3120.9663 3124.4579 3128.8388 3129.6647 3133.0963 3141.2447 3141.3516 3149.7688 3151.3446 3166.7983 3167.2206 3180.0106 3198.2677 3347.6032 3494.6255 3529.2781 3537.5612
redmass: 5.5307 6.0424 6.2472 4.4540 4.7750 3.7957 5.9417 3.7333 3.6673 6.0822 5.8496 5.4567 5.7081 4.4310 5.3482 1.3047 4.2163 6.9891 5.4977 6.2152 2.5027 2.9810 4.5350 6.0464 3.9837 2.2631 5.8624 6.4132 6.1097 5.5149 7.4495 5.2859 6.0705 2.9087 3.0960 4.9119 3.0444 5.1722 3.2491 1.6977 4.9796 2.4640 2.3298 2.2063 5.2954 6.2983 6.3421 6.3255 6.2653 6.9884 6.0391 2.1026 1.9210 2.0552 3.4330 1.8885 2.9852 2.5941 4.0841 3.2421 1.9621 1.7864 3.9768 6.1873 1.5279 3.7452 1.4363 1.2738 4.9370 3.1867 1.7979 1.9990 2.5428 1.6066 1.3760 1.3910 3.1565 4.3880 1.6241 6.1208 1.4054 8.7075 3.5427 2.5550 2.1202 6.0040 1.5708 1.5677 1.2398 1.2558 1.5568 1.7312 1.7537 2.5391 1.0518 1.0502 1.1192 1.1159 1.9240 1.3175 2.1256 2.0974 4.4455 1.6733 1.5466 1.7770 2.6521 4.0586 3.5682 3.0422 2.5439 2.0562 1.2591 1.5155 1.0579 2.0389 1.8876 1.0621 1.3705 1.0590 1.5970 2.3675 2.5737 3.0007 7.0903 5.9355 5.3797 5.6950 5.9895 5.3629 5.1399 1.0316 1.0323 1.1041 1.1047 1.0871 1.0861 1.1014 1.0868 1.0871 1.1006 1.0927 1.0925 1.0963 1.0959 1.1015 1.1015 1.0916 1.0925 1.0783 1.0766 1.0770 1.0760
irintensity: 0.7235 0.4074 0.2689 0.5077 0.2285 0.0803 1.3723 3.8890 3.7202 3.5294 1.0014 4.8094 1.3240 3.0271 7.0980 1.6259 5.2217 4.2476 4.7153 4.3477 5.6965 4.3944 0.1615 4.0324 0.9261 2.2397 1.8111 1.1853 3.0420 7.7524 8.3196 9.9987 76.4199 0.1984 5.2632 7.1201 21.6587 2.5319 10.1167 73.1598 15.8381 91.7549 52.5070 25.1083 6.3987 1.9593 20.1020 6.2814 14.5229 61.3917 7.5172 76.5350 35.2213 38.8697 12.0009 10.4022 29.3161 30.2860 38.2895 104.7032 29.0795 63.3800 161.9626 169.3220 23.1338 23.4861 9.2158 3.1893 86.9324 208.0419 142.8878 5.4060 54.5047 57.2463 0.3143 0.1414 1.6670 2.2212 2.9683 92.3293 6.3743 80.6524 84.7216 13.0732 32.2636 73.6779 17.9226 21.1879 2.4672 0.0564 4.5039 21.7701 19.9518 151.5711 1.8676 0.8560 3.8934 1.1701 300.2583 24.9183 95.7349 40.9989 30.2265 130.5784 64.8244 46.9324 157.8636 162.1202 95.0621 78.4142 55.8831 538.0505 12.8004 60.0865 1.9477 70.6727 281.2626 16.8499 87.6106 6.5878 64.9009 286.5565 259.5526 717.5971 112.7640 6.7215 97.5510 8.6975 207.4075 64.2467 15.8893 71.2269 58.3615 33.2632 36.1549 10.5596 10.0213 25.0362 2.3263 1.5799 15.2958 16.3650 26.9471 18.0176 8.7760 35.5195 23.3162 1.2904 13.8617 416.6377 64.1141 45.9515 26.6813
temp: 298.150 k
press: 1.00000 atm
elementType: 17 15 8 8 8 8 7 7 7 7 6 6 6 6 6 6 6 6 6 6 6 6 6 6 6 6 6 6 6 6 6 1 1 1 1 1 1 1 1 1 1 1 1 1 1 1 1 1 1 1 1 1 1
symmnumber: 1
zpe: 1054002.7 jmol-1
zpe.correction: 0.401448 hartree
zpe.thermalcorrener: 0.432183 hartree
zpe.thermalcorrenthalpy: 0.433127 hartree
zpe.thermalcorrgfe: 0.333371 hartree
zpe.sumelectzpe: -2132.380256 hartree
zpe.sumelectthermal: -2132.349521 hartree
zpe.sumelectthermalent: -2132.348577 hartree
zpe.sumelectthermalfe: -2132.448334 hartree
dipole: 4.0862 2.2381 -1.6372
dipole: 4.9383
quadrupole: -201.0635 -170.7117 -195.5081
quadrupole: 8.4184 -26.5315 -10.1589
quadrupole: -11.9691 18.3827 -6.4137 8.4184 -26.5315 -10.1589
hfenergy: -2132.7817042 hartree
pointgroup: C01 [X(C21H22Cl1N4O4P1)]
dipole: 1.6162169 1.0233016 -0.3396999 debye
polarizability: 378.7060594|0.5390551|363.2059654|43.3853444|-18.7849972|224.7916449 unknown
InChI: InChI=1S/C21H22ClN4O4P/c1-29-19-14-18(20(30-2)13-17(19)22)23-21(27)26-31(28,24-15-9-5-3-6-10-15)25-16-11-7-4-8-12-16/h3-14,23-26H,1-2H3
charge 0 multiplicity 1
53 atoms
Cl 7.256872 -0.180121 1.519392
P  -2.28287 0.25622 -1.054461
O  -3.03457 0.880422 -2.314492
O  3.619855 2.584432 -1.124168
O  0.3611 -0.859945 0.237134
O  4.738144 -1.935123 2.051146
N  -2.881033 0.786592 0.490866
N  -2.165087 -1.448631 -0.812283
N  -0.566806 0.739467 -1.194759
N  1.680835 0.920715 -0.561808
C  -3.239461 2.110667 0.873644
C  -3.20097 -2.404061 -0.991814
C  0.498205 0.203122 -0.455953
C  2.951522 0.56961 -0.040781
C  -3.302511 2.425303 2.257812
C  -2.956056 -3.746556 -0.594671
C  -3.543006 3.111355 -0.088641
C  -4.459473 -2.056329 -1.552465
C  4.013408 1.476208 -0.34882
C  3.226102 -0.57285 0.738794
C  4.537757 -0.82413 1.209997
C  5.319084 1.238942 0.11662
C  -3.669017 3.722761 2.6732
C  -3.960545 -4.72413 -0.753627
C  -3.890546 4.409172 0.343216
C  -5.45506 -3.045134 -1.698835
C  5.568951 0.08749 0.891981
C  -3.958277 4.726497 1.719808
C  -5.218362 -4.381891 -1.302207
C  4.63879 3.584367 -1.45481
C  5.396495 -3.097041 1.415102
H  -2.869102 0.073291 1.224649
H  -1.245027 -1.748608 -0.446499
H  -0.400384 1.444835 -1.918499
H  1.679767 1.817645 -1.058239
H  -3.061059 1.657573 3.0036
H  -1.984593 -4.018067 -0.164099
H  -3.53992 2.857809 -1.154011
H  -4.64614 -1.032009 -1.893288
H  2.422533 -1.261945 1.003345
H  6.137287 1.928604 -0.102377
H  -3.719524 3.949645 3.744148
H  -3.758096 -5.755837 -0.443965
H  -4.128092 5.173129 -0.406013
H  -6.421336 -2.766233 -2.134194
H  -4.238551 5.734078 2.0443
H  -5.996452 -5.142852 -1.422398
H  5.058507 4.037628 -0.537038
H  5.44946 3.136125 -2.059759
H  4.115012 4.351118 -2.043489
H  5.471907 -3.856829 2.207177
H  6.406369 -2.83353 1.050471
H  4.779161 -3.480071 0.579663
