program: Gaussian 09
title: 000266271
version: EM64L-G09RevD.01
frameworkgroup: C1[X(C2H5Cl2N2O3P)]
method: RPBEPBE
basis: SDD
operation: Freq
keyword: #p
keyword: freq=noraman
keyword: PBEPBE/SDD
title: #p freq=noraman PBEPBE/SDD
converged: YES YES NO NO
title: Mulliken charges:
elementType: Cl Cl P O O O N N C C H H H H H
charge: -0.175559 -0.115411 0.933650 -0.194100 -0.464645 -0.238972 -0.786517 -0.318533 0.427656 -0.491673 0.373914 0.320688 0.220663 0.237896 0.270942
chargesum: 0.00000
title: Mulliken charges with hydrogens summed into heavy atoms:
elementType: Cl Cl P O O O N N C C
charge: -0.175559 -0.115411 0.933650 -0.194100 -0.464645 -0.238972 -0.412603 0.002156 0.427656 0.237828
polarizability: 1.27088258e+02 -4.89293028e+00 9.52323550e+01 -6.61734804e+00 2.45859230e+00 7.20100501e+01
1716.lowfreq: -0.0025 -0.0024 -0.0016 2.0985 6.2175 9.3706 36.0957 45.4586 68.6231
frequency: 36.0243 45.4504 68.6179 97.4996 120.6917 141.1230 154.7733 186.8325 193.8920 224.3865 256.9855 277.4091 308.2231 329.1529 407.1205 419.6259 480.8604 512.6815 683.8084 723.6530 794.6766 863.4158 966.1940 1032.5748 1073.0578 1107.3547 1154.2954 1182.5127 1351.8594 1407.9818 1426.0219 1439.7655 1477.2227 1649.9364 2990.8178 3105.9521 3136.3151 3509.6437 3540.8635
redmass: 8.2245 4.4280 5.6197 7.5167 4.0638 10.8683 3.1541 7.1677 1.4925 16.3810 2.4502 12.5701 2.3474 5.3068 11.0325 4.7981 5.4060 1.5264 8.7064 7.9528 6.8901 6.3631 7.2055 5.2921 17.1183 1.2475 1.5307 2.0669 1.4812 1.2156 1.4505 1.0541 1.0540 8.3756 1.0290 1.1050 1.1052 1.0777 1.0802
irintensity: 1.1120 4.2485 0.7929 8.8215 7.8563 4.2331 0.7939 4.9309 4.8846 5.9568 52.9442 3.0582 13.2822 16.4887 73.1209 32.2438 73.3263 319.7129 25.2545 11.3635 58.6646 10.2260 23.7782 160.1856 109.4121 7.7532 17.2020 55.5688 219.3508 60.9824 151.5379 22.6840 14.6284 174.8946 43.0065 22.8611 11.3138 28.5331 44.0467
temp: 298.150 k
press: 1.00000 atm
elementType: 17 17 15 8 8 8 7 7 6 6 1 1 1 1 1
symmnumber: 1
zpe: 232549.7 jmol-1
zpe.correction: 0.088574 hartree
zpe.thermalcorrener: 0.101650 hartree
zpe.thermalcorrenthalpy: 0.102594 hartree
zpe.thermalcorrgfe: 0.046929 hartree
zpe.sumelectzpe: -1674.885668 hartree
zpe.sumelectthermal: -1674.872592 hartree
zpe.sumelectthermalent: -1674.871648 hartree
zpe.sumelectthermalfe: -1674.927313 hartree
dipole: -3.7880 -4.3997 -2.1525
dipole: 6.1919
quadrupole: -73.7235 -79.4890 -84.6986
quadrupole: 6.1965 -5.8361 2.0456
quadrupole: 5.5802 -0.1853 -5.3949 6.1965 -5.8361 2.0456
hfenergy: -1674.974242 hartree
pointgroup: C01 [X(C2H5Cl2N2O3P1)]
dipole: -1.3228034 1.8041243 0.9642399 debye
dipolederiv: -0.6148826 -0.2412135 -0.0259002 -0.3543657 -0.5940868 -0.0516332 -0.1252563 -0.1321026 -0.2745029 -0.3729421 0.1542662 -0.0690266 0.2589651 -0.5946593 0.2009594 -0.1324454 0.3188165 -0.3919588 2.2987005 -0.0231063 0.0323851 -0.2845979 1.9210352 -0.1579149 -0.1857849 -0.1537428 1.4547468 -0.4461991 0.0795548 -0.076393 -0.0644198 -0.2336989 -0.0601414 -0.0540887 -0.1103249 -0.2254331 -0.5722067 0.0146897 -0.03254 0.0917572 -0.512331 0.0255249 0.0360033 0.0035009 -0.5634739 -0.667937 -0.0370215 0.0217834 -0.0062081 -0.7827459 -0.1795709 0.026327 -0.2019648 -0.3715631 -1.8151501 -0.0025335 0.0963437 -0.1467579 -0.669068 0.1246535 0.3439409 0.0145271 -0.5869878 -0.5331811 0.3210404 0.0502928 0.4978639 -0.3757082 -0.07219 0.018686 0.0342923 -0.4290539 2.1167496 -0.1586274 -0.2317381 0.0757641 1.1475377 0.2800026 -0.1647167 0.3746655 0.4576054 0.3922018 -0.0269549 0.1097874 0.015899 0.2515853 -0.0054423 0.3252713 -0.0436503 0.2789516 0.0665648 -0.0063971 0.0494997 -0.0452988 0.2299045 -0.088405 -0.026155 -0.0763687 0.2757138 0.0817455 -0.0828027 0.0259785 -0.0910781 0.1924682 -0.0653935 0.0519796 -0.0754145 0.3154374 0.0585047 -0.0096626 -0.0380281 0.0728165 -0.1122687 0.1044804 -0.1239216 0.0722947 0.0094179 -0.0935343 -0.050766 0.0402497 -0.0613467 0.1124031 0.0270621 0.0454826 0.0357397 0.0527172 0.101566 0.0695343 0.0473056 0.0410071 0.0196327 -0.0819918 -0.035322 -0.060268 -0.0016164 unknown
polarizability: 128.2062071|3.9113322|94.9685561|0.4357042|1.3465856|71.1559002 unknown
InChI: InChI=1S/C2H5N2O3P.2Cl/c1-7-3-2(5)4-8-6;;/h3-4H,1H3;;
charge 0 multiplicity 1
15 atoms
Cl 3.286802 1.582848 -0.049049
Cl 2.442985 -1.736126 0.670602
P  1.750117 -0.007984 -0.575151
O  -3.092405 0.457907 1.211558
O  1.577112 -0.326657 -2.109013
O  -1.074721 -0.988557 -0.176264
N  0.446885 0.741989 0.302148
N  -1.821811 0.999359 0.828589
C  -0.859635 0.151924 0.303365
C  -3.972162 0.292362 0.015621
H  0.694869 1.525046 0.916594
H  -1.639727 1.918682 1.23597
H  -4.12161 1.261564 -0.493019
H  -4.917988 -0.074524 0.443326
H  -3.535911 -0.454535 -0.666976
