program: Gaussian 09
title: 000266251
version: EM64L-G09RevD.01
frameworkgroup: C1[X(C22H26N6O2)]
method: RPBEPBE
basis: SDD
operation: Freq
keyword: #p
keyword: freq=noraman
keyword: PBEPBE/SDD
title: #p freq=noraman PBEPBE/SDD
converged: YES YES NO NO
title: Mulliken charges:
elementType: O O N N N N N N C C C C C C C C C C C C C C C C C C C C C C H H H H H H H H H H H H H H H H H H H H H H H H H H
charge: -0.276931 -0.276755 0.053175 0.053530 -0.395620 -0.395567 -0.152275 -0.152016 0.339459 0.339038 -0.482346 -0.482605 -0.427111 -0.427185 -0.728910 -0.728685 -0.340961 -0.341038 -0.219196 -0.218901 -0.150630 -0.150519 0.168559 0.168106 0.100205 0.100072 -0.320006 -0.319456 -0.254434 -0.254718 0.212557 0.226200 0.226025 0.213183 0.241851 0.209331 0.241303 0.209310 0.231831 0.221433 0.232781 0.231773 0.221534 0.232815 0.240629 0.240393 0.209816 0.209724 0.225424 0.225453 0.304025 0.303937 0.298761 0.299246 0.232177 0.232210
chargesum: 0.00000
title: Mulliken charges with hydrogens summed into heavy atoms:
elementType: O O N N N N N N C C C C C C C C C C C C C C C C C C C C C C
charge: -0.276931 -0.276755 0.053175 0.053530 -0.091595 -0.091630 -0.152275 -0.152016 0.339459 0.339038 -0.043590 -0.043397 0.024071 0.023429 -0.042865 -0.042563 -0.100332 -0.100645 -0.009380 -0.009177 0.074794 0.074934 0.168559 0.168106 0.100205 0.100072 -0.021244 -0.020209 -0.022257 -0.022509
polarizability: 5.60122772e+02 -4.46043749e-01 2.76267340e+02 2.81895559e+01 2.37590746e-01 2.04522580e+02
1716.lowfreq: -4.2791 -0.0013 -0.0009 0.0001 0.7191 2.4740 11.4826 14.9814 21.2908
frequency: 11.4095 13.3946 21.1656 28.2544 35.7635 59.8558 62.3559 78.2310 112.5445 113.6883 134.5108 143.7552 154.1828 154.7561 175.4591 196.9648 222.4912 223.2794 227.0026 236.7037 242.8905 245.9408 266.1354 284.7903 287.0008 322.9564 346.0006 357.0555 371.5128 374.2665 406.8290 417.9894 423.0880 449.5327 451.3684 455.8586 465.9059 484.9033 514.7092 518.1301 524.5782 526.0614 530.7602 573.6240 619.5590 633.6267 636.0991 653.2104 689.4949 709.6503 710.5451 714.1913 719.2358 719.4073 725.3615 761.6027 778.8777 781.9977 783.2203 791.6664 808.3013 818.5314 833.3324 883.4718 885.6084 889.4297 891.0431 910.7695 912.5777 913.0566 933.9798 934.3798 968.0775 970.9847 994.4604 995.7126 1002.5872 1012.6553 1013.2915 1017.0235 1028.7863 1056.0599 1056.4816 1065.8030 1067.0147 1090.3493 1092.1737 1099.6537 1126.6427 1137.5757 1142.5607 1170.9591 1174.1070 1185.3235 1186.5382 1210.6463 1211.0230 1225.5716 1240.2690 1240.6062 1253.7377 1265.9715 1269.9751 1274.4093 1304.6740 1310.6057 1323.8869 1330.6747 1330.8697 1336.2547 1338.4272 1365.2739 1365.6278 1372.2078 1383.2276 1383.5037 1411.0290 1429.0207 1447.7633 1448.3152 1460.4611 1460.8001 1464.0060 1464.2637 1472.5184 1473.5357 1484.4342 1506.8440 1526.1072 1532.3416 1564.0306 1580.3863 1584.5363 1617.2152 1653.4351 1653.9025 2978.6346 2979.5259 2991.0564 2991.2094 3002.3940 3002.7389 3005.0359 3005.2814 3024.6581 3025.7743 3069.1406 3069.5475 3095.3075 3095.4186 3098.8694 3099.1798 3131.6020 3143.1711 3143.3644 3152.3444 3178.6110 3178.6518 3183.9128 3187.2354 3369.8382 3370.5308
redmass: 5.8687 4.1903 4.5597 4.8303 4.8558 5.5217 4.5413 4.8174 3.3182 4.0360 3.5713 4.8040 3.8878 3.8707 4.9952 3.7957 1.1883 1.0737 2.4632 2.9846 2.3945 3.0548 4.9931 2.7821 2.7240 3.6484 4.0952 4.2863 4.9558 5.7435 2.7606 2.5504 3.4874 4.5536 4.1140 4.6105 4.0240 4.1896 4.9339 5.3791 4.2833 4.5225 4.3173 5.2868 3.3885 6.8585 7.6850 3.8201 5.3058 1.3944 1.9487 1.6377 1.3951 1.4178 2.6567 2.0621 7.2425 4.8297 2.1587 1.3385 3.4087 3.1446 3.3417 1.5844 1.5921 3.2402 3.1923 1.3853 1.2592 1.2588 2.2307 2.2337 1.9408 1.9810 1.9407 1.9740 1.3757 2.1003 2.1038 1.3148 2.9356 1.9303 2.1355 2.9937 2.7761 2.7792 2.3648 3.2002 3.4509 2.0233 1.8395 2.3065 1.1714 1.7701 1.9632 1.4893 1.4720 3.0695 1.3789 1.3515 1.8177 2.8805 2.2319 2.7161 1.3506 1.5422 1.9801 1.4392 1.4429 1.5431 1.6690 1.5174 1.5130 4.8964 1.2179 1.2339 2.0384 2.9898 1.0806 1.0799 1.0688 1.0680 1.0983 1.0985 1.0553 1.0559 2.4462 6.4622 2.6233 1.9299 5.4312 8.4708 8.0326 6.1361 6.3332 6.3307 1.0595 1.0596 1.0355 1.0356 1.0775 1.0772 1.0755 1.0765 1.0935 1.0943 1.1025 1.1025 1.1002 1.1002 1.1003 1.1003 1.0871 1.0859 1.0858 1.0941 1.1011 1.1010 1.0938 1.0961 1.0735 1.0735
irintensity: 0.0225 0.0053 0.0328 0.0014 0.1006 1.1373 0.6259 0.1321 0.3953 6.3733 1.2798 4.2716 6.9504 6.6391 0.4326 8.8638 0.1868 0.3180 0.8881 26.8422 2.8642 19.1200 2.6913 1.7099 1.0321 9.1029 1.4040 4.5097 0.1933 0.0754 3.0710 17.2977 0.8077 0.3444 7.4239 0.0053 49.2072 8.6129 14.9424 0.2227 3.0682 6.0409 3.5085 0.2804 6.2724 5.0104 26.9845 0.1047 1.9990 12.9403 62.2374 79.8030 34.8883 51.3676 2.0888 7.7166 46.0223 0.4157 2.2618 68.4827 20.3607 13.9278 13.9966 34.7989 37.4398 0.2807 5.6195 0.0012 1.5874 1.8571 2.5665 1.1484 0.2237 9.6991 153.0097 12.3234 30.5576 11.2334 38.4239 0.0046 15.1389 189.3692 0.2747 7.4400 35.2528 0.3346 172.1004 1.3769 278.7950 8.7044 41.6238 68.3122 1.3747 6.0894 28.0356 11.7099 122.5197 1.5276 2.3139 40.1767 285.3715 27.2466 23.7013 2.4833 2.0661 23.3301 206.2965 5.1736 10.5321 13.3972 150.0380 2.2399 2.7156 0.1344 26.6026 5.0772 149.2838 26.1285 4.4569 4.3709 3.1644 12.8790 8.7231 6.0519 3.9555 3.8095 0.0269 311.6811 2.7827 377.2072 1.8160 360.8809 3.0558 7.0038 57.2890 59.9059 29.0542 28.4953 27.0546 16.6536 29.1129 41.1579 14.7362 14.0482 41.2198 42.4086 43.3336 29.5121 31.9666 33.9809 35.2457 29.5079 16.8252 3.3921 3.2182 15.8535 74.1580 8.0650 15.0197 20.9761 3.4532 8.4775
temp: 298.150 k
press: 1.00000 atm
elementType: 8 8 7 7 7 7 7 7 6 6 6 6 6 6 6 6 6 6 6 6 6 6 6 6 6 6 6 6 6 6 1 1 1 1 1 1 1 1 1 1 1 1 1 1 1 1 1 1 1 1 1 1 1 1 1 1
symmnumber: 1
zpe: 1178860.8 jmol-1
zpe.correction: 0.449004 hartree
zpe.thermalcorrener: 0.476891 hartree
zpe.thermalcorrenthalpy: 0.477835 hartree
zpe.thermalcorrgfe: 0.387974 hartree
zpe.sumelectzpe: -1330.571487 hartree
zpe.sumelectthermal: -1330.543601 hartree
zpe.sumelectthermalent: -1330.542656 hartree
zpe.sumelectthermalfe: -1330.632518 hartree
dipole: 0.0147 3.5306 0.0474
dipole: 3.5309
quadrupole: -179.3228 -173.1470 -173.0353
quadrupole: -0.0120 2.1520 -0.1302
quadrupole: -4.1544 2.0213 2.1331 -0.0120 2.1520 -0.1302
hfenergy: -1331.0204918 hartree
pointgroup: C01 [X(C22H26N6O2)]
dipole: 0.0038556 -1.3867473 0.0818654 debye
polarizability: 548.6779589|-2.1189678|276.0975165|-68.7658324|-3.2683943|216.1372177 unknown
InChI: InChI=1S/C22H26N6O2/c1-21(11-5-7-13-29-21)15-23-25-19-17-9-3-4-10-18(17)20(28-27-19)26-24-16-22(2)12-6-8-14-30-22/h3-4,7-10,13-16,25-26H,5-6,11-12H2,1-2H3
charge 0 multiplicity 1
56 atoms
O  7.22853 1.03441 -1.000159
O  -7.234161 1.053167 0.928834
N  3.636454 0.964686 -0.937777
N  -3.642888 1.028053 0.826135
N  2.657659 1.917807 -0.796194
N  -2.680648 1.968312 0.549424
N  0.648275 2.860414 -0.343328
N  -0.68119 2.873018 -0.01326
C  5.969936 0.366117 -1.490994
C  -5.959602 0.474753 1.487503
C  5.764066 -0.98606 -0.765943
C  -5.740314 -0.959806 0.948615
C  5.707272 -0.821088 0.77209
C  -5.709099 -1.006884 -0.598496
C  6.219758 0.187321 -3.000565
C  -6.189595 0.496026 3.010637
C  4.844468 1.363603 -1.25576
C  -4.853078 1.447956 1.106789
C  6.786269 0.132854 1.244252
C  -6.806819 -0.138108 -1.179151
C  7.462076 0.94105 0.386567
C  -7.483364 0.770152 -0.428966
C  0.699279 0.389896 -0.214667
C  -0.709263 0.40336 0.136418
C  1.322599 1.679452 -0.442581
C  -1.34372 1.704699 0.221769
C  1.377385 -0.865284 -0.31746
C  -1.378015 -0.838918 0.371493
C  0.694101 -2.064001 -0.083134
C  -0.686276 -2.050672 0.263156
H  4.838074 -1.455698 -1.14227
H  6.612597 -1.640442 -1.040801
H  -6.573168 -1.583591 1.324062
H  -4.801329 -1.360581 1.369926
H  4.706394 -0.458707 1.078645
H  5.842198 -1.809715 1.252886
H  -4.717637 -0.681286 -0.97043
H  -5.840297 -2.053743 -0.935751
H  6.416783 1.161921 -3.479671
H  5.338761 -0.272162 -3.481234
H  7.099487 -0.460319 -3.160564
H  -6.395181 1.523162 3.358398
H  -5.296447 0.115989 3.536241
H  -7.05797 -0.135752 3.267094
H  5.114574 2.426556 -1.408504
H  -5.137274 2.518083 1.124988
H  7.053103 0.164556 2.305878
H  -7.087555 -0.253731 -2.231335
H  8.283399 1.602651 0.676894
H  -8.317198 1.376368 -0.794701
H  2.865182 2.922978 -0.917432
H  -2.90027 2.97817 0.550815
H  2.435438 -0.858459 -0.583511
H  -2.435773 -0.811927 0.637414
H  1.226753 -3.017789 -0.166488
H  -1.21234 -2.994219 0.445806
