program: Gaussian 09
title: 000266250
version: EM64L-G09RevD.01
frameworkgroup: C1[X(C22H8F10N6)]
method: RPBEPBE
basis: SDD
operation: Freq
keyword: #p
keyword: freq=noraman
keyword: PBEPBE/SDD
title: #p freq=noraman PBEPBE/SDD
converged: YES YES NO NO
title: Mulliken charges:
elementType: F F F F F F F F F F N N N N N N C C C C C C C C C C C C C C C C C C C C C C H H H H H H H H
charge: -0.163054 -0.163048 -0.154624 -0.154632 -0.146449 -0.146452 -0.146450 -0.146450 -0.139419 -0.139421 -0.376652 -0.376646 -0.147089 -0.147100 0.046195 0.046176 0.177175 0.177181 0.105122 0.105130 -0.321828 -0.321837 -0.251949 -0.251945 0.300066 0.300074 -0.381306 -0.381302 0.089488 0.089451 0.100660 0.100695 0.093195 0.093186 0.076715 0.076731 0.106278 0.106273 0.328651 0.328670 0.243117 0.243119 0.312596 0.312598 0.249551 0.249559
chargesum: 0.00000
title: Mulliken charges with hydrogens summed into heavy atoms:
elementType: F F F F F F F F F F N N N N N N C C C C C C C C C C C C C C C C C C C C C C
charge: -0.163054 -0.163048 -0.154624 -0.154632 -0.146449 -0.146452 -0.146450 -0.146450 -0.139419 -0.139421 -0.064056 -0.064048 -0.147089 -0.147100 0.046195 0.046176 0.177175 0.177181 0.105122 0.105130 0.006823 0.006833 -0.008832 -0.008826 0.300066 0.300074 -0.131756 -0.131743 0.089488 0.089451 0.100660 0.100695 0.093195 0.093186 0.076715 0.076731 0.106278 0.106273
polarizability: 9.87810025e+02 4.78845047e-03 3.30984132e+02 4.27047602e-01 -2.32215141e-02 1.06862213e+02
1716.lowfreq: -6.2265 -0.0006 -0.0005 0.0007 1.1768 2.2150 9.2794 10.3020 20.6847
frequency: 9.1017 10.3018 20.6846 21.7210 26.7501 43.6563 52.1006 78.8618 108.0938 114.4191 119.5849 119.9271 124.3668 127.2618 132.6732 151.6892 154.2368 176.5924 185.0230 189.5178 216.3208 222.7408 243.5085 253.9268 254.0456 256.2546 260.8932 264.5995 264.6288 284.7014 292.0068 292.4851 309.6775 326.3560 327.8369 369.2970 370.0081 385.5477 389.6266 393.3248 405.4659 406.2346 426.2005 427.1255 429.8518 448.4683 455.9810 468.1906 488.3053 516.1774 539.3212 544.3802 587.4526 610.4775 622.5239 622.6385 626.0638 630.7257 631.1066 635.1834 656.6250 668.6963 722.7509 748.4148 749.8201 756.1060 757.6258 759.6139 762.0511 780.5514 785.8597 799.5401 829.2950 908.0291 908.9698 911.1563 911.3916 924.0675 959.6775 963.1066 1014.5028 1027.9382 1031.0861 1063.1853 1063.5206 1066.6025 1075.1448 1108.3529 1110.9545 1118.2516 1152.1996 1181.7013 1189.2713 1226.8176 1243.4240 1246.0167 1258.4977 1281.4740 1318.7479 1333.4148 1338.3735 1365.3352 1376.8612 1383.7224 1391.6279 1392.2939 1410.9084 1427.2599 1441.8161 1442.3394 1465.7127 1469.9868 1484.2323 1510.4882 1534.6599 1535.2034 1551.5264 1554.8073 1561.4272 1588.8954 1589.0090 1614.7954 1620.5790 1620.7553 3040.9562 3041.0485 3140.6088 3160.7295 3200.4797 3203.1931 3333.7900 3333.9914
redmass: 11.3139 16.8485 13.8288 7.8827 10.3059 10.4876 13.6433 7.4916 12.0582 13.6269 13.6206 18.2098 5.5588 12.6158 8.3439 11.6570 11.5661 4.1022 12.0887 9.8620 3.1251 11.1656 4.0917 18.0383 18.5338 8.8266 8.3155 18.5325 18.5184 6.5825 18.1471 17.2855 11.1887 16.1620 10.6174 12.0953 12.2591 11.9696 8.8347 7.3527 7.8631 10.7749 3.5726 15.5762 12.9727 11.9280 4.5794 11.4904 8.9483 8.9545 16.0481 13.8132 9.4061 10.4548 11.0872 12.0061 3.9275 9.5765 9.3894 7.4461 4.4755 7.0272 6.0259 2.3053 3.8572 2.2399 10.5145 1.6276 10.2594 7.6535 5.5502 1.3134 7.1625 10.8006 10.6486 1.5117 1.5133 1.3578 10.4052 9.9643 1.3436 1.3189 3.0271 10.5047 12.1397 5.4682 5.4673 7.7425 6.0849 6.5501 2.1898 1.1502 4.6469 4.1470 5.1861 4.8515 1.9559 5.1620 1.8230 2.1004 2.6211 6.4207 3.8156 3.6974 7.5867 8.2756 2.1051 3.4809 11.3113 8.7777 8.5498 8.5659 3.1203 7.1946 2.3629 2.4830 3.9181 6.3995 4.9948 9.0687 9.1076 6.1207 11.5368 10.8982 1.0872 1.0872 1.0879 1.0952 1.0939 1.0955 1.0733 1.0733
irintensity: 0.1871 0.0000 0.1670 0.3035 0.0000 0.4969 0.9112 0.0000 0.0389 0.0002 0.0000 0.0659 0.0003 3.4295 10.7465 0.0000 0.4761 19.6173 0.0002 0.1299 0.0012 3.7208 18.1211 0.2338 0.2995 0.0006 14.5712 0.1081 0.5383 3.5484 1.8328 0.0667 5.0709 1.4847 0.4213 0.0000 0.5014 0.0000 0.0215 0.0003 26.9641 0.2830 1.3344 0.2558 6.8801 32.4852 0.0004 0.8171 41.2604 4.6059 31.7657 0.0203 0.2761 23.3781 0.1685 0.0000 9.6248 0.0000 0.0338 1.8436 0.0000 10.8537 2.8948 0.0013 21.1349 0.0024 16.8463 116.9852 17.0492 49.7158 0.0005 86.1608 33.1827 67.9881 308.3113 0.1309 93.1489 0.0000 158.6491 45.2108 7.0829 0.0000 8.4523 0.2707 1.8438 1.4227 3.0398 82.0168 0.1430 0.0979 205.3933 0.2238 212.3520 0.2494 7.8497 0.0295 400.2249 17.2899 412.6076 73.9482 147.7427 1.1129 32.4611 11.7169 110.9736 4.4391 238.6823 0.1430 0.3246 367.2906 1403.3672 6.6729 5.1515 180.9951 0.5476 1404.8909 288.9950 48.5579 0.3414 30.3887 0.0597 0.1750 6.7235 5.0267 20.5161 28.7156 12.4564 11.8442 40.4978 10.3457 18.4986 20.5925
temp: 298.150 k
press: 1.00000 atm
elementType: 9 9 9 9 9 9 9 9 9 9 7 7 7 7 7 7 6 6 6 6 6 6 6 6 6 6 6 6 6 6 6 6 6 6 6 6 6 6 1 1 1 1 1 1 1 1
symmnumber: 1
zpe: 711587.2 jmol-1
zpe.correction: 0.271029 hartree
zpe.thermalcorrener: 0.303660 hartree
zpe.thermalcorrenthalpy: 0.304604 hartree
zpe.thermalcorrgfe: 0.203043 hartree
zpe.sumelectzpe: -2167.264612 hartree
zpe.sumelectthermal: -2167.231981 hartree
zpe.sumelectthermalent: -2167.231037 hartree
zpe.sumelectthermalfe: -2167.332598 hartree
dipole: 0.0000 -1.0379 -0.0018
dipole: 1.0379
quadrupole: -262.7700 -221.4430 -208.3702
quadrupole: 0.0019 0.0663 -0.0081
quadrupole: -31.9089 9.4181 22.4908 0.0019 0.0663 -0.0081
hfenergy: -2167.5356411 hartree
pointgroup: C01 [X(C22H8F10N6)]
dipole: -0.0007766 0.4083053 -0.0043955 debye
polarizability: 953.379258|-0.5432524|330.9654822|-170.7212477|-1.9777995|141.3116296 unknown
InChI: InChI=1S/C22H8F10N6/c23-11-9(12(24)16(28)19(31)15(11)27)5-33-35-21-7-3-1-2-4-8(7)22(38-37-21)36-34-6-10-13(25)17(29)20(32)18(30)14(10)26/h1-6,35-36H
charge 0 multiplicity 1
46 atoms
F  -7.435423 1.655271 1.504137
F  7.428548 1.651332 -1.546046
F  -4.708188 -2.347609 0.942408
F  4.713439 -2.348742 -0.910405
F  -6.913049 -3.891617 1.38874
F  6.922899 -3.894051 -1.328411
F  -9.645186 0.061959 1.952991
F  9.643045 0.056701 -1.965737
F  -9.4047 -2.731537 1.898504
F  9.411017 -2.736003 -1.859963
N  -2.693283 1.16151 0.531693
N  2.687469 1.160481 -0.564907
N  -0.674131 2.083114 0.111238
N  0.665291 2.082848 -0.161123
N  -3.64979 0.219843 0.729696
N  3.647124 0.218542 -0.745513
C  -0.712727 -0.39718 0.140079
C  0.711809 -0.397437 -0.146329
C  -1.340905 0.902983 0.256896
C  1.335869 0.902473 -0.285857
C  -1.395569 -1.644338 0.287125
C  1.39855 -1.644819 -0.271775
C  -0.69428 -2.849479 0.157243
C  0.700991 -2.849714 -0.121144
C  -5.987865 -0.27352 1.205881
C  5.986797 -0.275993 -1.212194
C  -4.880064 0.646815 0.979529
C  4.876104 0.64486 -1.002752
C  -7.279418 0.265985 1.470141
C  7.276715 0.262454 -1.486375
C  -5.913648 -1.695812 1.189093
C  5.916892 -1.697962 -1.169245
C  -7.038696 -2.509146 1.4170
C  7.04437 -2.511965 -1.382271
C  -8.414283 -0.526342 1.700735
C  8.413945 -0.53057 -1.702523
C  -8.296794 -1.929879 1.674607
C  8.3007 -1.933743 -1.650612
H  -2.464551 -1.638433 0.500796
H  2.467546 -1.639267 -0.485401
H  -1.228826 -3.798382 0.272346
H  1.238496 -3.798796 -0.219818
H  -2.901769 2.175965 0.568323
H  2.892624 2.174804 -0.619654
H  -5.12753 1.721009 1.027796
H  5.120138 1.718786 -1.070546
