program: Gaussian 09
title: 000266243
version: EM64L-G09RevD.01
frameworkgroup: C1[X(C18H22N6)]
method: RPBEPBE
basis: SDD
operation: Freq
keyword: #pfreq=noraman
keyword: PBEPBE/SDD
title: #p freq=noraman PBEPBE/SDD
converged: YES YES NO NO
title: Mulliken charges:
elementType: N N N N N N C C C C C C C C C C C C C C C C C C H H H H H H H H H H H H H H H H H H H H H H
charge: -0.427167 -0.392675 -0.053793 -0.150085 0.077819 0.018289 0.197437 0.180782 0.058803 0.096636 -0.339133 -0.319422 -0.250917 -0.260980 0.428957 0.435861 -0.388902 -0.396813 -0.774483 -0.789641 -0.295207 -0.289298 -0.733782 -0.733821 0.200530 0.315169 0.231880 0.233523 0.275583 0.299132 0.189778 0.206125 0.202735 0.244630 0.250416 0.214066 0.235150 0.235784 0.196595 0.202126 0.228200 0.228001 0.226868 0.230923 0.231075 0.223249
chargesum: 0.00000
title: Mulliken charges with hydrogens summed into heavy atoms:
elementType: N N N N N N C C C C C C C C C C C C C C C C C C
charge: -0.151585 -0.093543 -0.053793 -0.150085 0.077819 0.018289 0.197437 0.180782 0.058803 0.096636 -0.138603 -0.004253 -0.019037 -0.027457 0.428957 0.435861 -0.199124 -0.190688 -0.076703 -0.104640 -0.098612 -0.087172 -0.050713 -0.048574
polarizability: 7.41478870e+02 -4.13807019e+01 2.69949795e+02 4.82270416e+00 -1.68368975e+00 1.12842198e+02
1716.lowfreq: -0.0010 -0.0003 0.0014 2.0095 3.9546 9.7303 13.8200 19.2630 31.2949
frequency: 13.6648 18.4633 31.2930 42.8090 45.5510 56.9371 78.6226 85.8838 98.4951 100.3569 112.5747 130.0128 139.9671 151.9697 157.4462 172.5176 177.2089 206.0708 227.3580 257.3592 272.1915 302.4290 303.6396 308.5689 316.9913 343.4398 369.0380 381.6326 417.3126 450.9215 466.2260 477.9291 483.5766 503.7470 509.2803 509.8266 548.0911 573.5914 607.6359 617.4542 624.2528 650.5187 666.3857 719.4834 731.2654 765.7589 768.4720 783.1142 793.2016 824.4796 828.3902 829.4374 859.5211 876.8382 913.9024 915.0269 967.2886 969.6936 970.3032 998.0975 1017.5809 1033.3125 1033.4496 1037.8539 1040.2820 1043.6568 1045.4807 1045.8106 1077.7789 1083.1498 1098.6713 1119.4502 1135.3833 1160.8731 1180.2454 1219.7660 1241.8338 1247.1318 1252.8398 1261.0683 1329.4485 1340.7088 1350.2581 1370.7238 1371.5676 1381.0277 1395.1314 1397.1434 1400.7751 1404.4304 1407.2120 1421.8022 1456.5841 1460.0745 1461.4458 1463.3676 1465.3409 1466.1093 1467.8428 1472.1712 1474.0093 1508.3500 1528.6782 1549.7517 1551.3901 1559.8240 1568.7986 1616.1547 1648.3639 1651.7178 2939.2866 2962.5164 2963.4845 2980.9534 2986.9778 2996.3820 3027.0606 3028.2458 3061.0032 3065.5469 3071.3790 3072.9442 3096.8183 3096.8666 3109.7928 3111.5716 3120.2423 3138.2466 3159.0052 3181.9476 3358.0961 3403.4268
redmass: 2.6070 5.1079 4.4185 4.5051 2.5713 4.4491 1.9648 1.4405 3.3491 1.0972 1.0650 1.0531 4.1283 4.5517 4.1244 4.3798 4.9685 4.8039 2.7576 4.3212 3.8466 3.3037 2.9789 3.0202 3.1272 4.0963 4.5784 7.5508 3.4945 4.7141 5.6515 5.7611 5.5214 4.5358 2.1981 2.5638 1.5545 4.4283 3.9386 3.4121 3.3043 4.5400 6.9738 1.2904 5.5527 7.3253 1.7656 3.0250 4.2560 1.1840 1.1885 2.9472 3.6480 1.4531 1.4884 1.5017 1.7691 1.3941 1.6328 5.2085 1.3181 1.4801 1.4667 1.7493 2.1951 1.6255 1.5188 1.7970 3.2953 4.1695 2.8832 3.7222 2.9555 2.4918 1.1605 3.1255 3.4134 1.6563 1.5505 1.7347 1.7629 2.1854 2.9566 1.3431 1.3041 2.3427 1.6557 1.6612 1.7678 1.4693 1.6008 2.5592 1.0439 1.0462 1.2508 1.1078 1.0477 1.0468 1.7024 1.0951 1.1123 4.2412 2.2548 4.6055 3.2468 3.8413 5.7664 5.8256 5.3696 5.4168 1.0862 1.0390 1.0388 1.0863 1.0389 1.0372 1.0963 1.0962 1.0970 1.0880 1.0885 1.0964 1.0959 1.0963 1.0968 1.0986 1.0863 1.0902 1.0974 1.0960 1.0732 1.0737
irintensity: 1.3292 1.4207 0.2299 0.0640 1.3010 0.4397 3.5307 0.0284 0.1460 0.2917 0.0589 1.3667 4.9922 5.2003 8.0495 5.2069 0.2378 0.3405 38.3475 3.0864 14.0971 0.3432 0.8745 1.9605 1.8618 5.4324 2.1919 1.3904 1.3194 1.5748 0.5147 10.0146 4.0929 7.0336 2.4945 4.7449 54.8026 25.8830 2.1446 27.8656 1.2871 6.0365 9.5258 91.6909 1.4374 35.1941 46.3271 33.2077 48.1590 11.1094 7.5965 2.0236 2.7641 1.7293 47.0954 44.4622 133.9817 1.7514 15.4501 99.8937 1.7683 0.1103 0.0073 30.9978 37.2736 3.1416 1.2258 2.4306 21.5650 11.3583 91.6382 19.8314 328.0848 16.9867 1.2412 117.2771 116.5546 13.6113 1.4310 77.7302 15.0457 95.7819 95.6946 55.1617 4.1511 251.0083 86.3692 42.1762 165.9865 9.6724 47.6022 230.3011 4.9811 1.0619 7.9066 25.4159 20.1536 24.8803 26.9111 13.1609 10.5202 8.9198 467.0709 342.3320 22.2899 3.7588 37.0869 24.9863 30.5968 42.8265 54.7697 85.1424 68.4265 47.1026 10.5735 15.4839 25.1862 23.2604 19.4617 14.0956 8.1489 13.9033 28.9376 37.8625 54.6846 47.5338 5.8173 25.1539 20.8830 28.2388 2.1345 18.7700
temp: 298.150 k
press: 1.00000 atm
elementType: 7 7 7 7 7 7 6 6 6 6 6 6 6 6 6 6 6 6 6 6 6 6 6 6 1 1 1 1 1 1 1 1 1 1 1 1 1 1 1 1 1 1 1 1 1 1
symmnumber: 1
zpe: 967606.2 jmol-1
zpe.correction: 0.368542 hartree
zpe.thermalcorrener: 0.393627 hartree
zpe.thermalcorrenthalpy: 0.394571 hartree
zpe.thermalcorrgfe: 0.310519 hartree
zpe.sumelectzpe: -1025.767901 hartree
zpe.sumelectthermal: -1025.742816 hartree
zpe.sumelectthermalent: -1025.741872 hartree
zpe.sumelectthermalfe: -1025.825924 hartree
dipole: 1.5135 4.0441 -0.2924
dipole: 4.3279
quadrupole: -97.1124 -128.3090 -149.2093
quadrupole: -14.5099 1.3954 -0.7130
quadrupole: 27.7645 -3.4321 -24.3324 -14.5099 1.3954 -0.7130
hfenergy: -1026.1364428 hartree
pointgroup: C01 [X(C18H22N6)]
dipole: 0.4905829 -1.3436801 0.9236424 debye
polarizability: 744.8034988|12.7413108|226.7963241|-0.0346519|-67.3502935|152.6710401 unknown
InChI: InChI=1S/C18H22N6/c1-5-13(3)11-19-21-17-15-9-7-8-10-16(15)18(24-23-17)22-20-12-14(4)6-2/h5-12,21-22H,1-4H3
charge 0 multiplicity 1
46 atoms
N  -2.919315 -0.044976 0.245176
N  2.396032 1.269048 -0.498052
N  -1.178268 1.323578 -0.577111
N  0.163133 1.59112 -0.740271
N  -3.873065 0.750507 -0.35265
N  3.582349 0.690823 -0.120503
C  -0.596528 -0.771384 0.614728
C  0.809739 -0.466854 0.473283
C  -1.548643 0.190951 0.077483
C  1.119238 0.762809 -0.231544
C  -0.973155 -1.991347 1.257614
C  1.780188 -1.374277 1.00229
C  -0.005929 -2.866093 1.766629
C  1.376689 -2.551564 1.643611
C  -6.217219 1.273552 -0.666075
C  6.009847 0.781346 -0.10033
C  -5.136096 0.487019 -0.065369
C  4.698028 1.319447 -0.461121
C  -5.810369 2.387675 -1.609749
C  6.036575 -0.521059 0.676555
C  -7.511176 0.946486 -0.330608
C  7.124723 1.490599 -0.487668
C  -8.785925 1.596108 -0.8063
C  8.573947 1.155553 -0.242222
H  -2.028045 -2.274722 1.348821
H  2.835398 -1.120078 0.88701
H  -0.314422 -3.797065 2.25464
H  2.12901 -3.238661 2.045687
H  -3.208698 -0.801826 0.879333
H  2.368574 2.159146 -1.024004
H  -5.430413 -0.327278 0.632844
H  4.676396 2.271726 -1.028497
H  -6.676046 2.948823 -1.995367
H  -5.240326 1.978954 -2.463516
H  -5.125143 3.0892 -1.101336
H  7.061667 -0.850508 0.906843
H  5.53198 -1.321361 0.104192
H  5.481363 -0.414573 1.626826
H  -7.651696 0.108046 0.371647
H  6.953994 2.42343 -1.04951
H  -9.371879 1.985726 0.050111
H  -9.435137 0.858499 -1.319327
H  -8.608537 2.431663 -1.502617
H  9.07549 1.971297 0.315789
H  9.120229 1.052368 -1.201118
H  8.71264 0.222128 0.327152
