program: Gaussian 09
title: 000024789
version: EM64L-G09RevD.01
frameworkgroup: C1[X(C10H11ClFNO2)]
method: RPBEPBE
basis: SDD
operation: Freq
keyword: #p
keyword: freq=noraman
keyword: PBEPBE/SDD
title: #p freq=noraman PBEPBE/SDD
converged: YES YES NO NO
title: Mulliken charges:
elementType: Cl F O O N C C C C C C C C C C H H H H H H H H H H H
charge: -0.047583 -0.205723 -0.441761 -0.215940 -0.268400 -0.406441 0.508359 -0.307530 0.144155 -0.324221 -0.376230 -0.201724 -0.204467 -0.313107 -0.120652 0.223473 0.239657 0.216816 0.232975 0.278431 0.236056 0.259683 0.257675 0.219766 0.258607 0.358127
chargesum: 0.00000
title: Mulliken charges with hydrogens summed into heavy atoms:
elementType: Cl F O O N C C C C C C C C C C
charge: -0.047583 -0.205723 -0.083634 -0.215940 -0.268400 0.056689 0.508359 0.142261 0.144155 -0.045790 -0.140173 0.057959 0.053207 0.165266 -0.120652
polarizability: 1.92426475e+02 -1.43934953e+00 1.05282164e+02 -4.47615424e+00 -2.09230718e+01 9.72718619e+01
1716.lowfreq: -8.8241 0.0017 0.0021 0.0025 2.4312 4.5370 31.8435 44.9933 58.7972
frequency: 31.5780 44.9668 58.7889 64.2885 90.3008 134.8971 145.1335 164.7811 213.8785 251.5931 274.0257 295.5219 312.3075 327.7434 381.0729 399.6098 407.9291 446.9280 490.0390 500.1024 560.9167 590.3479 624.0911 647.6829 708.7785 742.2958 812.5626 817.9100 830.0876 864.9731 919.4561 940.6405 954.2302 995.4231 1003.7210 1007.6798 1013.0867 1058.3126 1076.6121 1093.0953 1120.2011 1167.5916 1187.2441 1203.5271 1219.0600 1232.6854 1296.0469 1320.2280 1331.0009 1341.8314 1362.5704 1370.0557 1376.4808 1401.3892 1457.3715 1461.6103 1478.6333 1487.1688 1582.9219 1596.4661 1617.9670 2989.3667 2990.5401 3032.9612 3065.1116 3080.4289 3102.4137 3146.4612 3166.3972 3174.1599 3192.6660 3574.5473
redmass: 5.5966 5.3511 10.3951 7.1426 6.1573 6.8289 2.6526 3.2262 7.2861 8.3172 4.3719 5.1846 1.1865 6.6273 4.0481 4.2282 3.0036 4.8896 2.9145 2.8926 3.8728 3.0434 6.7382 6.3173 3.6160 5.6070 1.2710 1.9468 2.4154 3.5231 1.8421 1.3735 1.3675 4.1304 4.9105 3.5452 1.9533 2.1734 3.0011 2.8774 1.4617 1.3344 1.1775 1.7656 1.3709 1.8703 1.2708 1.6245 1.2335 1.2695 2.0133 1.5893 2.4641 3.3724 1.0800 1.0851 2.2863 1.1055 7.6564 6.5714 9.8872 1.0561 1.0639 1.0640 1.1075 1.1005 1.0990 1.0886 1.0904 1.0961 1.0962 1.0666
irintensity: 0.5674 0.6812 0.6506 1.4666 4.8993 4.1249 7.1103 28.1962 5.9858 2.7722 7.2287 3.1631 158.8629 3.3049 10.3919 0.9982 0.1409 11.4593 4.1381 24.9154 7.6981 14.7976 0.5463 1.7626 2.5061 21.2913 1.1661 49.5964 28.1415 3.4366 36.0758 1.0028 0.2472 28.4509 158.7174 44.5998 11.6853 3.0232 44.8451 3.4449 11.2829 84.5710 2.0583 36.1840 21.1061 31.6476 2.1409 83.1988 8.1460 9.6640 25.6235 9.0013 57.1252 5.2292 11.3692 6.1586 166.8559 25.5415 11.0707 21.0595 183.2931 17.5595 35.4486 24.6544 4.9524 27.4813 26.3446 9.0668 1.8752 3.3445 0.6119 8.3936
temp: 298.150 k
press: 1.00000 atm
elementType: 17 9 8 8 7 6 6 6 6 6 6 6 6 6 6 1 1 1 1 1 1 1 1 1 1 1
symmnumber: 1
zpe: 510951.9 jmol-1
zpe.correction: 0.194611 hartree
zpe.thermalcorrener: 0.209531 hartree
zpe.thermalcorrenthalpy: 0.210475 hartree
zpe.thermalcorrgfe: 0.150819 hartree
zpe.sumelectzpe: -1151.622075 hartree
zpe.sumelectthermal: -1151.607155 hartree
zpe.sumelectthermalent: -1151.606211 hartree
zpe.sumelectthermalfe: -1151.665867 hartree
dipole: -0.6288 5.2776 -1.6679
dipole: 5.5705
quadrupole: -112.1095 -103.7876 -86.2240
quadrupole: 8.9663 -5.7506 -7.3971
quadrupole: -11.4025 -3.0805 14.4830 8.9663 -5.7506 -7.3971
hfenergy: -1151.8166858 hartree
pointgroup: C01 [X(C10H11Cl1F1N1O2)]
dipole: 0.3733502 -2.0663688 -0.6275319 debye
dipolederiv: -0.9042742 -0.1022577 -0.0545521 -0.1031445 -0.0957027 -0.0361878 -0.0697513 -0.0340586 -0.1070276 -0.5623378 0.2042758 0.0403051 0.3618912 -0.4645161 -0.0396644 0.1094763 -0.0610335 -0.2551479 -0.3816988 0.1722242 0.1373333 0.1845812 -0.4454776 0.0917392 0.2072152 0.1931266 -0.7521563 -0.5505369 -0.1464623 -0.021884 0.3455464 -1.0339273 -0.0678182 0.0177998 -0.1678192 -0.3062198 -1.2933069 0.3063317 0.0141729 0.3230327 -0.8342621 -0.0201013 0.0252032 -0.0611304 -0.3253993 0.1178672 0.1506833 -0.0020638 0.1885228 0.4661047 0.0355667 0.1311084 0.0733883 0.1203668 1.0100291 0.0993935 -0.0037977 0.1857883 -0.0849997 0.0068888 0.1310116 -0.0374241 0.0910454 0.3354684 -0.0736493 -0.1083212 -0.1012299 0.2804825 0.0381524 -0.1891874 -0.0041212 0.5030214 1.1384213 -0.3256373 0.0287602 -0.805572 1.4129913 0.1200629 -0.2179592 0.2223038 0.1534277 -0.0678731 -0.0456543 -0.0285718 -0.2106893 -0.0768162 0.0787431 -0.0098377 0.0424857 -0.045302 -0.1294135 0.0197105 0.0179198 0.0527952 -0.0818031 0.067364 0.0037478 0.1015488 -0.0240273 -0.2940956 0.018178 0.0297439 -0.0022694 -0.0338965 0.0800556 0.0398416 0.0532173 -0.0043469 -0.263216 -0.0557729 -0.0663867 -0.0665418 -0.0861514 0.0478192 -0.1222876 0.0367745 -0.0288192 0.3164354 -0.2629027 -0.0705187 -0.4682789 0.4680177 0.0517233 -0.1333578 0.0679005 0.3717259 1.2555789 0.1572339 0.0886822 0.1670848 0.0057855 0.09143 0.117493 0.0943186 0.0454507 0.068202 0.071008 0.1235911 0.0402561 -0.0184933 -0.0171654 0.0909722 -0.0635757 -0.0407422 -0.1161953 -0.0315136 -0.0943873 -0.0090086 0.0345237 0.0485554 -0.0434262 0.032033 0.0662484 -0.1545796 0.0743962 -0.03118 0.0348975 0.0928657 -0.0179996 -0.0339166 -0.0062095 -0.0178738 0.0526317 -0.0887457 0.0039313 -0.052291 -0.1293214 -0.061461 0.0265689 -0.0282104 0.0422236 0.0459599 0.0289322 0.0618491 0.0305122 0.1175286 -0.0506873 0.0518157 -0.0241031 0.075575 0.0521848 -0.0516242 -0.0724628 -0.0478564 0.0829854 -0.0961118 -0.0777807 -0.0951215 0.0239045 0.0643733 -0.0294909 -0.0387412 -0.0250542 0.1052244 -0.0834397 -0.0469897 -0.078474 0.0453621 0.028782 0.0303963 0.062483 0.0257598 0.1206849 -0.0697765 0.0641967 -0.0619223 0.0586287 0.0082119 0.0259098 -0.0081275 0.0397955 0.0285889 -0.0582474 -0.0192078 -0.0866425 -0.0911794 0.0432742 -0.0228086 0.0246244 0.0013869 -0.0015604 0.0068744 0.0266172 0.0458743 0.04425 0.1801077 -0.1221538 -0.0324015 -0.0899147 0.1711445 -0.1463145 -0.0793657 -0.1531253 0.3570116 unknown
polarizability: 192.3076045|4.9538735|106.2425971|0.8802905|20.913205|96.4302993 unknown
InChI: InChI=1S/C10H11ClFNO2/c11-8-1-3-9(4-2-8)13(5-6-14)10(15)7-12/h1-4,14H,5-7H2
charge 0 multiplicity 1
26 atoms
Cl 5.097157 0.602164 0.11187
F  -4.105584 1.603937 0.00968
O  -2.242121 -2.044519 1.582839
O  -1.456839 1.983205 0.100438
N  -0.909233 -0.240354 -0.425403
C  -1.367528 -1.625137 -0.71361
C  0.518051 -0.017817 -0.300616
C  -1.327285 -2.527266 0.539414
C  -1.818993 0.815461 -0.197068
C  1.044738 0.741472 0.776456
C  1.407936 -0.569449 -1.257017
C  2.436222 0.935135 0.900742
C  2.802213 -0.388004 -1.134974
C  -3.315117 0.454406 -0.350577
C  3.299197 0.361917 -0.052631
H  -0.738562 -2.073495 -1.502642
H  -2.395347 -1.602419 -1.108223
H  -0.289455 -2.611884 0.919344
H  -1.691259 -3.534679 0.275386
H  0.372024 1.204718 1.500725
H  1.025666 -1.123653 -2.120313
H  2.838763 1.523987 1.729728
H  3.483975 -0.812002 -1.877527
H  -3.557277 0.205314 -1.401954
H  -3.596565 -0.377986 0.32004
H  -1.808076 -1.314351 2.091493
