program: Gaussian 09
title: 000266242
version: EM64L-G09RevD.01
frameworkgroup: C1[X(C24H22N6)]
method: RPBEPBE
basis: SDD
operation: Freq
keyword: #pfreq=noraman
keyword: PBEPBE/SDD
title: #p freq=noraman PBEPBE/SDD
converged: YES YES NO NO
title: Mulliken charges:
elementType: N N N N N N C C C C C C C C C C C C C C C C C C C C C C C C H H H H H H H H H H H H H H H H H H H H H H
charge: -0.387191 -0.387247 -0.154257 -0.154368 0.012026 0.012101 0.170780 0.170963 0.096480 0.096523 -0.313399 -0.313625 -0.252813 -0.252715 0.304751 0.305008 0.321266 0.321167 -0.416333 -0.416238 -0.351143 -0.351306 -0.409256 -0.409212 -0.828111 -0.828048 -0.241556 -0.241534 -0.231165 -0.231195 0.299237 0.299177 0.231895 0.231900 0.301336 0.301341 0.246005 0.246071 0.220821 0.220671 0.229205 0.229192 0.231160 0.231052 0.233780 0.231080 0.233771 0.231133 0.227256 0.227265 0.228137 0.228161
chargesum: 0.00000
title: Mulliken charges with hydrogens summed into heavy atoms:
elementType: N N N N N N C C C C C C C C C C C C C C C C C C C C C C C C
charge: -0.085855 -0.085905 -0.154257 -0.154368 0.012026 0.012101 0.170780 0.170963 0.096480 0.096523 -0.014162 -0.014448 -0.020918 -0.020815 0.304751 0.305008 0.321266 0.321167 -0.195512 -0.195567 -0.105137 -0.105235 -0.180051 -0.180020 -0.132120 -0.132064 -0.014300 -0.014269 -0.003028 -0.003034
polarizability: 9.54287008e+02 -1.51367114e-02 3.46644417e+02 3.22454627e-01 -6.49308621e-02 1.23054459e+02
1716.lowfreq: -5.6475 -0.0016 0.0010 0.0020 2.4560 7.2898 10.2718 16.5080 19.8230
frequency: 9.9291 16.4953 19.6475 23.9446 37.6919 50.1991 79.3347 94.5529 133.8952 138.5698 141.7832 144.7371 153.9073 162.3068 163.7149 171.9922 193.0152 209.1614 225.9293 243.7468 247.4661 294.4627 310.5078 311.5343 333.0439 374.5284 375.0329 377.8428 422.0643 454.9549 455.5471 457.0675 470.4242 477.5694 479.3108 500.0723 531.3290 531.5702 532.5775 544.0089 597.7317 617.6852 620.6829 647.7450 652.0862 652.5221 698.5990 724.4153 725.8261 728.0689 730.6679 762.3157 768.8601 768.9103 779.6265 781.8891 788.2051 791.1273 809.5683 867.1424 876.4901 876.8125 889.2070 910.8201 913.9865 914.4443 956.4217 956.6498 986.1861 986.2514 990.3579 990.7647 1002.4248 1016.9938 1028.4407 1042.7040 1042.7934 1046.5298 1047.0333 1065.1256 1065.5795 1097.6349 1097.7039 1113.9221 1142.4677 1167.9519 1173.4188 1173.8862 1175.1495 1191.7618 1197.5262 1226.4110 1248.1712 1251.1489 1253.0827 1276.7293 1292.6639 1293.8934 1315.2784 1333.3464 1339.6650 1371.6460 1382.3650 1384.5130 1399.4707 1399.5196 1411.5909 1427.5459 1436.1561 1438.0231 1467.7942 1467.8788 1475.9929 1476.1247 1483.2476 1483.5314 1487.4560 1510.9436 1532.7924 1533.0892 1544.1569 1544.6546 1564.2893 1579.4164 1579.7090 1612.5497 1612.6327 1617.0576 2971.1578 2971.2455 3013.0763 3013.4997 3046.1967 3046.2448 3084.7957 3084.8283 3122.2002 3122.2400 3132.5981 3134.3543 3134.3718 3152.3370 3152.3965 3153.3830 3167.0541 3167.1476 3186.5796 3189.7601 3347.6924 3348.0504
redmass: 6.3263 3.7083 4.2109 5.7221 5.3293 5.3688 5.5040 3.9733 4.9108 4.0778 5.9229 5.5161 4.6262 1.2018 1.0846 2.4658 3.2805 3.5617 3.1839 4.1549 5.6497 5.7422 3.8246 3.7255 4.6170 4.2756 8.9483 3.5532 3.4687 3.2204 2.8079 3.8039 4.9921 6.5620 5.4769 6.4304 3.2815 3.2731 5.5343 5.7609 7.3021 3.4789 7.1472 6.9724 7.1079 4.0275 5.6157 1.4477 1.8805 1.8618 1.4649 5.4736 1.4634 1.4606 7.5884 5.5867 4.7495 1.3347 5.2267 3.9010 1.3190 1.3154 4.1854 1.4028 1.5340 1.5145 1.3971 1.3963 1.6005 1.6009 1.3389 1.3373 1.3509 1.3162 2.8877 1.5568 1.5567 2.1776 2.1279 5.3606 4.2965 3.1244 2.3266 2.3818 2.2519 2.3738 1.0780 1.0804 1.1447 1.9902 2.4186 3.1299 2.7677 1.8585 2.1807 3.5837 1.5337 1.5690 1.7826 1.9201 2.2069 6.3049 3.6458 3.4395 1.3157 1.3265 2.1087 2.8580 2.1783 2.2385 2.0853 2.2170 1.0458 1.0457 1.3341 1.2649 2.5696 6.7629 2.6732 2.3490 3.9594 5.8006 5.0842 5.6757 5.5959 6.2481 6.2253 6.1190 1.0383 1.0383 1.0858 1.0858 1.0976 1.0976 1.0974 1.0974 1.0860 1.0860 1.0872 1.0891 1.0891 1.0940 1.0940 1.0943 1.0995 1.0995 1.0937 1.0959 1.0731 1.0730
irintensity: 0.0086 0.0030 0.9281 0.0192 0.0001 0.0002 0.8735 0.0000 0.2600 0.0066 0.3859 0.0503 12.0765 9.5991 0.9886 2.1909 0.0031 13.5796 0.0010 24.7048 0.1406 6.3033 0.0068 1.1091 1.0101 0.2274 0.0197 41.1373 1.1397 0.0317 18.2247 0.0018 4.9332 109.7579 0.7195 0.9498 1.7913 0.0355 2.8906 1.4635 13.0413 5.6454 0.1653 2.7991 0.2785 0.0082 0.5497 0.0734 4.5251 0.1560 203.2506 1.3282 4.3711 74.6572 65.3519 0.0003 0.1121 91.2799 5.6087 1.5053 0.0025 0.0191 0.2818 0.0132 67.7159 5.3387 5.4762 0.1861 3.3648 3.4398 0.0166 0.0028 6.7275 0.0007 11.9421 6.7239 7.3826 16.0705 4.5045 2.2784 23.3976 0.9446 143.6236 0.3243 339.5971 111.2400 0.0003 0.2735 0.9374 0.3872 38.2233 1.0480 8.4121 484.2751 2.9808 15.6158 10.0313 7.1560 267.1916 41.1591 146.5240 0.0983 13.1919 11.9820 0.8184 16.3465 236.6356 14.7914 38.5062 0.2693 26.8405 3.6646 13.6108 14.0632 1.1092 170.4953 3.1045 377.5717 7.3270 1245.8085 65.5633 9.7466 0.2036 0.7964 2.2759 1.3786 6.9157 12.0915 31.8316 40.9992 37.2086 54.2018 18.2275 23.2569 60.8733 2.8713 33.1779 4.1378 16.9120 11.4316 12.2928 54.3117 21.9213 15.7897 22.7555 34.5973 18.7984 20.5142 1.4007 8.9166
temp: 298.150 k
press: 1.00000 atm
elementType: 7 7 7 7 7 7 6 6 6 6 6 6 6 6 6 6 6 6 6 6 6 6 6 6 6 6 6 6 6 6 1 1 1 1 1 1 1 1 1 1 1 1 1 1 1 1 1 1 1 1 1 1
symmnumber: 1
zpe: 1072705.4 jmol-1
zpe.correction: 0.408572 hartree
zpe.thermalcorrener: 0.434875 hartree
zpe.thermalcorrenthalpy: 0.435819 hartree
zpe.thermalcorrgfe: 0.348619 hartree
zpe.sumelectzpe: -1254.111061 hartree
zpe.sumelectthermal: -1254.084758 hartree
zpe.sumelectthermalent: -1254.083814 hartree
zpe.sumelectthermalfe: -1254.171014 hartree
dipole: 0.0007 0.8122 0.0253
dipole: 0.8126
quadrupole: -129.6359 -161.0418 -185.8021
quadrupole: -0.0082 0.1690 -0.1273
quadrupole: 29.1907 -2.2152 -26.9755 -0.0082 0.1690 -0.1273
hfenergy: -1254.519633 hartree
pointgroup: C01 [X(C24H22N6)]
dipole: -0.0085219 -0.2964411 0.1193828 debye
polarizability: 949.2989526|8.073935|320.0392697|63.0987438|-71.9925258|154.6476614 unknown
InChI: InChI=1S/C24H22N6/c1-17-9-3-5-11-19(17)15-25-27-23-21-13-7-8-14-22(21)24(30-29-23)28-26-16-20-12-6-4-10-18(20)2/h3-16,27-28H,1-2H3
charge 0 multiplicity 1
52 atoms
N  -2.703678 1.346285 -0.742866
N  2.776522 1.372248 -0.291652
N  -0.622329 2.225149 -0.896851
N  0.740467 2.23137 -0.784968
N  -3.718969 0.462046 -0.491579
N  3.746723 0.49444 0.113586
C  -0.723896 -0.097557 -0.041824
C  0.72253 -0.0907 0.077556
C  -1.337607 1.116134 -0.544044
C  1.398699 1.128888 -0.318813
C  -1.446668 -1.272297 0.333396
C  1.385098 -1.258812 0.567268
C  -0.768979 -2.400914 0.809603
C  0.649133 -2.394068 0.926932
C  -6.116756 0.016967 -0.507799
C  6.12192 0.06881 0.469353
C  -7.44047 0.508818 -0.76494
C  7.467826 0.561577 0.391909
C  -4.953171 0.878346 -0.738041
C  5.001031 0.920307 0.060758
C  -5.949867 -1.315703 -0.027194
C  5.891259 -1.25506 0.947607
C  -8.540218 -0.351973 -0.5294
C  8.524818 -0.289952 0.796481
C  -7.692474 1.918503 -1.278886
C  7.787389 1.962206 -0.109318
C  -7.05653 -2.152236 0.199132
C  6.956338 -2.082485 1.343504
C  -8.363678 -1.669807 -0.052771
C  8.285163 -1.599233 1.269023
H  -2.533216 -1.259809 0.238042
H  2.472542 -1.236519 0.650231
H  -1.335851 -3.294316 1.093795
H  1.17008 -3.28228 1.301005
H  -2.894071 2.295056 -1.109946
H  3.015087 2.32289 -0.624161
H  -4.933961 -1.676001 0.162243
H  4.859236 -1.615512 1.000458
H  -5.133672 1.897381 -1.126903
H  5.231045 1.940732 -0.297207
H  -9.553222 0.020342 -0.72381
H  9.554571 0.082704 0.738726
H  -7.304833 2.689156 -0.585505
H  -7.216443 2.092318 -2.263036
H  -8.773907 2.097889 -1.399985
H  7.316142 2.744445 0.516194
H  8.875885 2.13902 -0.093458
H  7.441676 2.119938 -1.148862
H  -6.907065 -3.172921 0.568208
H  6.757839 -3.096382 1.708151
H  -9.234315 -2.312075 0.119832
H  9.123933 -2.234251 1.574826
