program: Gaussian 09
title: 000266241
version: EM64L-G09RevD.01
frameworkgroup: C1[X(C24H22N6O2)]
method: RPBEPBE
basis: SDD
operation: Freq
keyword: #p
keyword: freq=noraman
keyword: PBEPBE/SDD
title: #p freq=noraman PBEPBE/SDD
converged: YES YES NO NO
title: Mulliken charges:
elementType: O O N N N N N N C C C C C C C C C C C C C C C C C C C C C C C C H H H H H H H H H H H H H H H H H H H H H H
charge: -0.272667 -0.272659 -0.384140 -0.384145 -0.154518 -0.154521 0.016274 0.016273 0.170122 0.170130 0.099079 0.099083 -0.314092 -0.314105 -0.251714 -0.251711 0.489129 0.489117 -0.408492 -0.408489 -0.494413 -0.494412 -0.412835 -0.412832 0.349562 0.349571 -0.215473 -0.215488 -0.370100 -0.370097 -0.536671 -0.536681 0.300875 0.300871 0.234526 0.234528 0.301758 0.301759 0.209756 0.209760 0.266115 0.266121 0.224461 0.224461 0.223923 0.223925 0.242948 0.242945 0.245052 0.220865 0.220671 0.220675 0.245052 0.220864
chargesum: 0.00000
title: Mulliken charges with hydrogens summed into heavy atoms:
elementType: O O N N N N N N C C C C C C C C C C C C C C C C C C C C C C C C
charge: -0.272667 -0.272659 -0.082382 -0.082385 -0.154518 -0.154521 0.016274 0.016273 0.170122 0.170130 0.099079 0.099083 -0.013217 -0.013234 -0.017188 -0.017183 0.489129 0.489117 -0.198736 -0.198729 -0.228298 -0.228290 -0.188374 -0.188371 0.349562 0.349571 0.008449 0.008437 -0.127151 -0.127151 0.149918 0.149910
polarizability: 9.32015370e+02 -5.36141699e-04 3.83494405e+02 -6.14502313e-01 2.39161931e-03 1.27032134e+02
1716.lowfreq: -6.7351 -4.2388 -0.0018 -0.0005 0.0017 0.9412 6.9668 10.2021 17.7352
frequency: 6.9652 10.1969 17.7352 20.6580 36.9675 37.2329 65.4400 76.1806 97.0112 100.6234 103.9477 135.0549 150.4589 153.1447 163.1058 186.7899 195.2844 197.6512 230.0022 236.3218 242.7732 246.3838 262.2151 263.9585 264.7978 299.1034 300.5131 304.7256 331.0812 376.3864 409.6238 422.4445 430.0136 455.9289 456.9033 457.3495 464.3625 466.1202 487.7271 509.5288 544.1000 545.9659 587.1616 600.8060 601.4015 619.5453 621.7119 648.7551 652.9475 659.3066 692.2600 692.2827 695.0673 726.1917 727.8462 730.2977 761.5726 779.7956 781.0136 781.0639 782.7939 792.7279 826.3598 866.3849 866.4240 892.8867 893.8108 912.8286 923.1632 923.8698 924.5050 930.4235 966.0924 966.1019 980.5782 980.7495 1003.3616 1017.8553 1018.2550 1018.5289 1028.6923 1065.0013 1067.0699 1092.0048 1093.7344 1104.2967 1110.5088 1110.5207 1133.5736 1145.4820 1147.9768 1161.5382 1163.9247 1174.0837 1175.5497 1190.1517 1195.3312 1226.0660 1251.6925 1254.2279 1254.8454 1275.5844 1283.1594 1284.7515 1316.5676 1340.0734 1349.0031 1376.4810 1396.9353 1397.0401 1411.6213 1427.8469 1429.8023 1430.5169 1449.7749 1449.9259 1465.5710 1465.5874 1468.4187 1469.1328 1473.4486 1474.0107 1486.2760 1510.5925 1532.9725 1534.7509 1553.3739 1555.4570 1564.4182 1582.8260 1583.0978 1616.5047 1618.0754 1618.2200 2957.3549 2957.4253 2986.7360 2986.8384 3044.8180 3044.8341 3123.6531 3123.6800 3125.3723 3125.3823 3133.9908 3146.7152 3146.7462 3154.5365 3170.3798 3170.4318 3175.0346 3175.0869 3187.9933 3191.1052 3350.0583 3350.3558
redmass: 4.6948 5.9379 5.7363 5.1287 5.6901 4.9968 4.0291 3.5468 4.3963 6.7818 3.8115 5.6924 4.7046 6.2291 6.0059 3.7638 1.7279 1.6472 2.2897 3.6301 3.6486 2.4792 2.2203 7.2531 2.6452 4.2896 4.1275 4.8112 5.7516 9.4895 5.5760 3.4754 5.6994 4.0410 2.9684 3.2596 5.8826 6.1550 6.6965 7.1233 5.1268 4.8503 7.4519 4.0836 4.2457 3.6238 7.1793 7.0461 4.0630 7.4798 1.8495 1.8480 5.9691 1.2859 6.2427 1.3102 5.3350 7.5305 1.6420 1.5416 4.6524 1.3392 6.2396 1.3846 1.3850 1.5143 1.5058 1.3954 1.6283 1.6085 4.6077 4.7141 1.3400 1.3401 5.9453 5.9483 1.3521 2.8323 2.8058 1.3185 2.8597 4.2415 5.5104 1.8169 2.1615 2.8766 1.2599 1.2599 2.5333 1.5864 1.6888 1.5436 1.4532 1.7879 1.1593 1.3479 1.6582 2.8045 1.7877 2.7942 2.2360 3.0334 1.4587 1.6550 1.8072 1.8906 2.0106 4.7419 7.5744 7.4994 2.0970 2.2450 1.3407 1.5718 2.2435 2.2232 1.0508 1.0510 2.2542 1.9842 1.1401 1.1967 2.9018 6.9716 2.6840 2.1075 5.3235 6.2418 5.0473 5.5153 5.4265 6.3759 6.7097 6.4512 1.0330 1.0330 1.0865 1.0865 1.1039 1.1039 1.0989 1.0989 1.0868 1.0869 1.0873 1.0932 1.0932 1.0944 1.0954 1.0954 1.0920 1.0920 1.0937 1.0959 1.0731 1.0731
irintensity: 0.0000 0.0360 0.1929 1.5293 0.1069 0.0001 6.6995 0.0020 13.9807 0.0157 0.0006 10.3726 0.0001 0.0560 1.7249 12.9482 0.0003 1.1568 0.0006 2.5960 7.6603 10.0742 0.0079 13.3171 17.4434 0.0001 0.1391 1.0574 0.1209 0.0001 9.0266 1.1071 0.5750 0.0000 10.6785 0.0004 3.3724 0.3040 121.7398 2.1519 13.9200 3.2948 7.5725 0.1456 0.0013 5.2974 0.6727 0.8923 0.0003 0.3383 0.1289 56.1434 7.5839 0.0003 1.5100 176.6230 24.3300 62.3952 0.4607 93.0829 0.0003 64.3070 0.8461 5.1777 0.0455 0.0011 8.0447 0.0000 118.0430 0.0347 5.2034 4.9015 0.3403 5.7892 0.6110 7.8043 7.3828 61.6001 75.8107 0.1093 16.8253 19.4090 2.1465 107.4010 0.8713 0.1019 0.2424 0.2269 500.1518 48.4193 37.3709 65.9939 127.1554 31.4963 1.3979 26.2149 1.2800 31.2702 336.6490 59.9251 216.4929 5.0588 0.0043 95.5774 326.2655 61.8530 65.8829 14.5050 39.0743 5.9347 232.6107 0.8844 0.0722 53.8374 1.3222 95.9399 0.5005 25.4275 61.7034 11.2063 53.5977 55.3892 3.4683 406.8741 1.6542 1152.8250 264.6423 94.9169 2.9588 60.2625 29.7393 0.1882 92.8435 60.0076 115.1430 69.8055 3.8942 95.4985 1.7457 97.6120 9.0819 30.1933 9.0591 7.8572 15.5668 29.0490 33.6525 13.5632 34.3468 13.0001 3.1587 2.8861 19.5894 15.7861 0.7785 12.6667
temp: 298.150 k
press: 1.00000 atm
elementType: 8 8 7 7 7 7 7 7 6 6 6 6 6 6 6 6 6 6 6 6 6 6 6 6 6 6 6 6 6 6 6 6 1 1 1 1 1 1 1 1 1 1 1 1 1 1 1 1 1 1 1 1 1 1
symmnumber: 1
zpe: 1093244.0 jmol-1
zpe.correction: 0.416395 hartree
zpe.thermalcorrener: 0.444885 hartree
zpe.thermalcorrenthalpy: 0.445829 hartree
zpe.thermalcorrgfe: 0.352401 hartree
zpe.sumelectzpe: -1404.360379 hartree
zpe.sumelectthermal: -1404.331889 hartree
zpe.sumelectthermalent: -1404.330945 hartree
zpe.sumelectthermalfe: -1404.424372 hartree
dipole: -0.0002 3.1975 -0.0032
dipole: 3.1975
quadrupole: -98.9087 -165.5540 -196.4547
quadrupole: -0.0005 0.1921 0.0104
quadrupole: 54.7304 -11.9149 -42.8155 -0.0005 0.1921 0.0104
hfenergy: -1404.7767738 hartree
pointgroup: C01 [X(C24H22N6O2)]
dipole: 0.0006512 1.2579932 -0.0053579 debye
polarizability: 928.1051218|0.008139|383.4872345|55.9708222|-1.3600545|130.9495527 unknown
InChI: InChI=1S/C24H22N6O2/c1-31-19-9-5-7-17(13-19)15-25-27-23-21-11-3-4-12-22(21)24(30-29-23)28-26-16-18-8-6-10-20(14-18)32-2/h3-16,27-28H,1-2H3
charge 0 multiplicity 1
54 atoms
O  6.805631 2.307103 0.4767
O  -6.802672 2.309108 -0.505874
N  2.741746 -2.741112 0.199313
N  -2.74422 -2.740208 -0.175137
N  0.680491 -3.667151 0.063251
N  -0.683856 -3.666921 -0.030616
N  3.733246 -1.800468 0.265191
N  -3.734814 -1.799279 -0.249963
C  0.723743 -1.190402 0.053803
C  -0.724631 -1.190153 -0.045046
C  1.367875 -2.488357 0.104385
C  -1.37007 -2.487894 -0.083042
C  1.418028 0.058473 0.094583
C  -1.417667 0.058966 -0.097817
C  0.710671 1.265401 0.040719
C  -0.709108 1.26565 -0.055525
C  6.119549 -1.322646 0.43107
C  -6.120703 -1.320668 -0.419227
C  4.978467 -2.238166 0.353423
C  -4.980549 -2.236562 -0.332768
C  5.960072 0.086695 0.419074
C  -5.959574 0.088532 -0.423585
C  7.433211 -1.872181 0.522466
C  -7.435118 -1.869693 -0.502569
C  7.088313 0.931215 0.496907
C  -7.086948 0.933409 -0.509619
C  8.550476 -1.020116 0.599354
C  -8.551518 -1.017265 -0.587597
C  8.396859 0.385791 0.587894
C  -8.396253 0.3885 -0.592491
C  7.936003 3.233796 0.565107
C  -7.932117 3.235958 -0.603943
H  2.506158 0.041481 0.167871
H  -2.505814 0.042338 -0.170914
H  1.256525 2.214682 0.073003
H  -1.254009 2.215124 -0.096918
H  2.955532 -3.753432 0.21847
H  -2.959025 -3.752452 -0.184139
H  5.207332 -3.32226 0.372924
H  -5.21058 -3.320555 -0.340703
H  4.96389 0.531581 0.350031
H  -4.962778 0.532996 -0.361088
H  7.56801 -2.960161 0.532287
H  -7.571163 -2.957559 -0.499843
H  9.557044 -1.447146 0.669162
H  -9.558678 -1.443877 -0.651098
H  9.278941 1.029627 0.64846
H  -9.277647 1.032684 -0.6592
H  7.486682 4.237351 0.537024
H  8.493415 3.101705 1.513083
H  8.627367 3.111619 -0.291653
H  -8.622362 3.125069 0.25525
H  -7.48163 4.239268 -0.588821
H  -8.491075 3.092864 -1.549411
