program: Gaussian 09
title: 000266239
version: EM64L-G09RevD.01
frameworkgroup: C1[X(C22H16Cl2N6)]
method: RPBEPBE
basis: SDD
operation: Freq
keyword: #p
keyword: freq=noraman
keyword: PBEPBE/SDD
title: #p freq=noraman PBEPBE/SDD
converged: YES YES NO NO
title: Mulliken charges:
elementType: Cl Cl N N N N N N C C C C C C C C C C C C C C C C C C C C C C H H H H H H H H H H H H H H H H
charge: -0.065277 -0.065273 -0.382504 -0.382496 -0.150023 -0.150010 0.010010 0.009972 0.173141 0.173094 0.101310 0.101306 -0.312931 -0.312883 -0.250135 -0.250162 0.535562 0.535546 -0.393189 -0.393160 -0.292710 -0.292715 -0.347569 -0.347590 -0.224051 -0.224048 -0.230134 -0.230143 -0.224791 -0.224787 0.295603 0.295608 0.232797 0.232805 0.309925 0.309926 0.235635 0.235639 0.252175 0.252203 0.257426 0.257426 0.232455 0.232457 0.237280 0.237281
chargesum: 0.00000
title: Mulliken charges with hydrogens summed into heavy atoms:
elementType: Cl Cl N N N N N N C C C C C C C C C C C C C C C C C C C C C C
charge: -0.065277 -0.065273 -0.072579 -0.072570 -0.150023 -0.150010 0.010010 0.009972 0.173141 0.173094 0.101310 0.101306 -0.017328 -0.017274 -0.017338 -0.017358 0.535562 0.535546 -0.157554 -0.157520 -0.292710 -0.292715 -0.095393 -0.095387 0.033374 0.033378 0.002321 0.002314 0.012489 0.012493
polarizability: 9.50146388e+02 1.77864422e-03 3.56281761e+02 6.02749776e-02 -1.25942284e-01 1.09091969e+02
1716.lowfreq: -4.8975 -0.0004 0.0023 0.0026 1.8688 5.5178 9.7076 10.9021 15.3196
frequency: 9.3242 10.8750 15.2762 23.0224 38.1190 48.3778 79.4104 93.3183 104.8527 130.8594 132.9487 136.8708 139.7994 165.9499 179.0152 200.1393 222.1530 229.1391 248.6478 286.8114 290.4976 306.6881 307.8491 344.4665 345.3629 378.6329 387.3396 405.6936 421.7239 451.1471 451.2255 456.5422 467.8241 477.6106 493.0754 516.6237 531.2802 531.4787 589.4456 618.4259 619.9650 641.7560 645.6883 653.9510 677.7440 687.7862 714.0817 722.3964 722.5045 736.2402 740.5572 762.3879 762.4544 779.2723 782.7733 790.6881 791.0516 868.2509 868.7923 869.1919 890.6103 909.8478 923.0278 923.1108 952.9819 953.2011 988.2494 988.7438 1000.8638 1011.9613 1012.0508 1016.4093 1028.8002 1037.5837 1037.7622 1066.1262 1073.4194 1100.9595 1116.0828 1123.8598 1145.0173 1169.4207 1169.9932 1172.3281 1175.4888 1213.6857 1231.6494 1239.5760 1251.3280 1271.1581 1285.1345 1289.2048 1314.5809 1327.8249 1334.6346 1370.6818 1378.8438 1381.8100 1411.6244 1425.6125 1425.7742 1428.1852 1455.0006 1456.6895 1486.5485 1510.6859 1532.6704 1534.8405 1542.6196 1545.1448 1564.1425 1568.1959 1568.2334 1603.3092 1603.3469 1617.6347 3035.1358 3035.2504 3133.8834 3138.9429 3138.9595 3154.5246 3154.7721 3154.8147 3168.3623 3168.3835 3178.3914 3178.4331 3189.9160 3192.9896 3350.0069 3350.2760
redmass: 6.4246 8.1535 9.1077 7.5406 5.8188 6.5737 5.8315 4.1807 17.1694 7.3871 4.8520 6.5321 5.9565 4.6590 5.5494 4.8098 7.2094 3.3071 4.0492 7.1146 8.7792 4.6058 4.4675 7.5647 6.3870 9.3627 11.6635 9.3956 3.4514 3.3268 3.3076 4.5668 6.5321 7.4977 6.9777 7.2033 3.4694 3.4829 7.5123 4.0146 5.8188 7.2781 7.4436 4.2155 6.7416 7.1362 5.8648 3.1698 3.1486 1.2989 1.3201 1.2891 1.2888 7.8488 5.4538 1.3549 5.8944 3.3918 1.3773 1.4834 4.5196 1.3907 1.5273 1.5252 1.3844 1.3835 1.3454 1.3437 1.3532 7.0899 7.1129 1.3211 2.8477 2.0037 2.0061 4.3383 5.9427 3.8763 1.9305 1.7650 2.1696 1.3124 1.0650 1.8843 1.1597 2.0320 1.7807 2.5116 1.8193 3.7247 1.7018 1.8210 1.7211 1.9276 2.3296 6.5105 4.2828 4.0221 2.1340 2.5821 2.5191 3.0287 2.5726 2.4109 2.9763 6.9237 2.6031 2.4154 3.9334 6.0064 4.8778 5.8974 5.5605 6.8243 6.8377 6.1318 1.0875 1.0875 1.0873 1.0858 1.0859 1.0939 1.0902 1.0908 1.0947 1.0947 1.1000 1.1000 1.0935 1.0956 1.0733 1.0733
irintensity: 0.0079 0.0004 0.0116 0.0070 0.0055 0.6257 0.1656 0.0140 0.0028 11.4340 2.8426 0.6185 2.7998 5.1067 0.0124 16.7328 2.4037 0.1160 28.7484 3.7254 0.2758 0.0005 0.0364 6.4444 11.2667 0.0073 1.0457 6.1026 0.9759 1.5059 18.2487 0.0222 2.5170 2.2899 121.7697 0.0086 1.9707 0.0064 23.6993 5.3492 1.8298 12.1790 4.5418 0.0329 10.4286 51.1895 11.2203 0.1620 0.0403 0.0702 203.2443 2.0333 99.5328 66.1776 0.1922 94.3397 9.1278 0.4254 0.0091 0.1864 0.6588 0.0059 74.8505 5.0999 11.1322 0.0954 0.0362 0.0137 7.3456 101.8676 53.7615 0.0828 6.9465 31.1036 0.7073 10.7744 0.2344 2.5922 32.2609 8.5940 324.9648 25.7417 0.0750 145.0413 0.9302 0.7651 52.9866 8.1341 448.3535 9.0842 24.8128 9.8346 220.5708 56.0875 246.8735 2.8322 1.0320 0.6926 251.6178 55.4255 70.6100 0.0676 63.5777 33.2278 1.6811 360.4989 0.8527 1424.5182 101.8890 7.6560 1.4401 28.4947 28.7930 6.3764 1.3724 9.2933 38.3587 33.7300 14.6000 1.2433 2.4117 5.9712 6.0906 18.8103 7.9404 9.2330 27.6105 16.5775 15.7667 20.4417 2.2951 16.2274
temp: 298.150 k
press: 1.00000 atm
elementType: 17 17 7 7 7 7 7 7 6 6 6 6 6 6 6 6 6 6 6 6 6 6 6 6 6 6 6 6 6 6 1 1 1 1 1 1 1 1 1 1 1 1 1 1 1 1
symmnumber: 1
zpe: 879175.6 jmol-1
zpe.correction: 0.334860 hartree
zpe.thermalcorrener: 0.360440 hartree
zpe.thermalcorrenthalpy: 0.361384 hartree
zpe.thermalcorrgfe: 0.274143 hartree
zpe.sumelectzpe: -2094.435032 hartree
zpe.sumelectthermal: -2094.409452 hartree
zpe.sumelectthermalent: -2094.408508 hartree
zpe.sumelectthermalfe: -2094.495749 hartree
dipole: -0.0008 5.2679 -0.0008
dipole: 5.2679
quadrupole: -159.8736 -175.1809 -196.5740
quadrupole: 0.0019 0.0991 -0.0343
quadrupole: 17.3359 2.0286 -19.3645 0.0019 0.0991 -0.0343
hfenergy: -2094.7698923 hartree
pointgroup: C01[X(C22H16Cl2N6)]
dipole: -0.0007379 0.8178634 1.9043591 debye
polarizability: 950.1421358|1.8260834|147.5254607|-0.4554036|89.5678496|317.8525213 unknown
InChI: InChI=1S/C22H16Cl2N6/c23-19-11-5-1-7-15(19)13-25-27-21-17-9-3-4-10-18(17)22(30-29-21)28-26-14-16-8-2-6-12-20(16)24/h1-14,27-28H
charge 0 multiplicity 1
46 atoms
Cl -7.836332 -1.006146 -2.446669
Cl 7.838875 -0.950998 -2.461239
N  -2.74792 -0.688727 -1.680861
N  2.749789 -0.673924 -1.684432
N  -0.681885 -1.056745 -2.527382
N  0.68464 -1.053342 -2.528174
N  -3.74177 -0.320051 -0.818852
N  3.742651 -0.304305 -0.821682
C  -0.72556 -0.041664 -0.268506
C  0.725879 -0.037801 -0.269466
C  -1.371092 -0.5781 -1.450255
C  1.372689 -0.571055 -1.451936
C  -1.420829 0.47511 0.868488
C  1.419929 0.483059 0.866406
C  -0.712502 0.978739 1.965673
C  0.710408 0.982898 1.964552
C  -6.118198 -0.141897 -0.367423
C  6.118592 -0.117757 -0.371157
C  -4.989549 -0.50387 -1.224646
C  4.990923 -0.480161 -1.229485
C  -7.466977 -0.31308 -0.787491
C  7.467754 -0.275663 -0.795162
C  -5.923618 0.402791 0.939855
C  5.922611 0.413591 0.941384
C  -8.566428 0.028927 0.01993
C  8.566268 0.06687 0.013302
C  -7.008087 0.751003 1.762459
C  7.006134 0.762109 1.765108
C  -8.336881 0.566001 1.306083
C  8.335345 0.590751 1.304638
H  -2.511228 0.465006 0.852958
H  2.510352 0.479003 0.849318
H  -1.258395 1.372655 2.82992
H  1.255358 1.380142 2.827869
H  -2.960793 -1.099096 -2.606948
H  2.963729 -1.081205 -2.611635
H  -5.221295 -0.931877 -2.215565
H  5.223829 -0.901516 -2.222979
H  -4.893919 0.539542 1.283236
H  4.892604 0.539326 1.288052
H  -9.583675 -0.122495 -0.351785
H  9.583861 -0.073972 -0.361615
H  -6.824597 1.165773 2.759188
H  6.821582 1.166313 2.765971
H  -9.187809 0.834411 1.940415
H  9.185539 0.859426 1.939842
