program: Gaussian 09
title: 000266238
version: EM64L-G09RevD.01
frameworkgroup: C1[X(C24H22N6O2)]
method: RPBEPBE
basis: SDD
operation: Freq
keyword: #p
keyword: freq=noraman
keyword: PBEPBE/SDD
title: #p freq=noraman PBEPBE/SDD
converged: YES YES NO NO
title: Mulliken charges:
elementType: O O N N N N N N C C C C C C C C C C C C C C C C C C C C C C C C H H H H H H H H H H H H H H H H H H H H H H
charge: -0.289054 -0.288985 -0.381642 -0.381629 -0.154194 -0.154115 0.006747 0.006718 0.169063 0.168887 0.096292 0.096220 -0.315279 -0.315036 -0.253186 -0.253326 0.300059 0.300045 0.213676 0.213683 -0.397976 -0.398018 -0.343274 -0.343294 -0.351828 -0.351797 -0.248690 -0.248729 -0.235109 -0.235074 -0.534745 -0.534789 0.299132 0.299194 0.230059 0.230064 0.303486 0.303464 0.251860 0.251915 0.249430 0.249416 0.239154 0.239175 0.227196 0.227199 0.226073 0.226052 0.245311 0.223862 0.223606 0.245309 0.223623 0.223799
chargesum: 0.00000
title: Mulliken charges with hydrogens summed into heavy atoms:
elementType: O O N N N N N N C C C C C C C C C C C C C C C C C C C C C C C C
charge: -0.289054 -0.288985 -0.078156 -0.078165 -0.154194 -0.154115 0.006747 0.006718 0.169063 0.168887 0.096292 0.096220 -0.016148 -0.015842 -0.023128 -0.023262 0.300059 0.300045 0.213676 0.213683 -0.146116 -0.146103 -0.093844 -0.093878 -0.112674 -0.112623 -0.021494 -0.021530 -0.009036 -0.009022 0.158033 0.157943
polarizability: 1.00684554e+03 -7.24897083e-03 3.64770544e+02 -8.96022489e-03 2.33890791e-01 1.26871687e+02
1716.lowfreq: -5.2267 -2.6148 -2.3226 -0.0016 0.0005 0.0017 7.3678 10.4800 14.4750
frequency: 6.7823 10.1820 13.8162 24.4107 36.4277 48.0536 76.6726 91.4354 95.9747 97.9404 106.0000 131.2451 136.4178 138.0601 143.1467 175.5462 200.5577 209.7461 221.1763 226.5920 246.4929 256.7749 257.0123 257.7784 282.9257 297.2632 323.1252 323.5919 332.2527 374.5599 401.2111 417.7883 422.3350 456.4844 471.1889 475.6739 475.7735 478.6819 507.3819 510.3155 545.2123 545.4055 551.4624 568.4475 592.3662 617.7874 625.1177 646.5213 652.7008 658.2378 698.6431 725.3818 728.8164 741.6088 741.9842 750.5877 755.5714 755.6563 765.0643 779.3319 782.0653 790.8143 798.4924 854.4063 854.5440 871.3490 893.0682 910.8082 931.7890 931.8615 942.4613 942.7257 978.1633 978.4276 988.8361 989.2501 1002.5226 1016.6367 1028.2727 1042.8299 1043.0915 1063.4887 1065.5904 1093.8012 1097.0679 1111.2080 1113.0062 1113.0901 1140.8197 1150.9145 1151.1101 1167.1012 1172.5644 1174.2498 1174.4403 1201.1014 1207.4059 1227.2107 1239.1932 1240.2761 1251.6978 1271.5406 1293.4361 1294.7576 1312.6169 1325.8734 1334.1045 1373.1281 1389.0607 1389.9667 1411.1926 1427.4855 1429.4222 1430.4916 1447.5306 1448.3293 1466.7332 1466.9092 1467.7107 1467.7327 1481.1903 1482.2305 1487.6064 1509.4655 1531.9044 1532.9092 1546.0151 1546.8488 1564.5708 1585.9065 1586.1322 1605.1564 1605.2042 1616.6901 2963.1101 2963.3534 3043.6043 3043.8342 3052.4580 3052.7561 3125.6468 3125.7729 3130.9454 3133.1444 3133.2794 3148.4990 3148.5521 3151.9687 3163.2313 3163.2790 3173.2033 3173.3179 3184.8258 3188.0316 3352.9961 3353.3617
redmass: 4.3960 6.4698 4.9098 5.7167 5.4193 5.4351 5.5698 3.8964 3.2593 3.4099 5.6416 5.3071 4.2307 6.4195 6.1702 3.5265 2.6770 2.5164 4.6945 2.8662 3.7494 1.5636 2.3060 1.9371 5.9539 4.3256 3.6945 3.6354 6.1173 9.5370 5.9753 6.2890 3.4820 4.6378 7.2764 3.1193 3.1091 6.9645 6.0879 6.9744 3.5517 3.5694 5.5711 5.5863 7.0990 3.5150 6.6312 6.7961 4.0654 6.6841 5.6299 1.3024 1.3575 3.4329 3.2371 5.7888 1.2665 1.2659 5.6471 7.7648 5.6372 1.3352 6.1960 1.4357 1.4326 4.2955 4.5002 1.3866 1.4316 1.4328 1.4408 1.4371 1.3346 1.3341 8.8297 8.8019 1.3512 1.3135 2.9015 2.0805 2.0713 5.9024 4.2742 2.6524 3.0307 2.7299 1.2585 1.2585 2.1578 1.3944 1.4530 1.8986 1.1085 1.1588 1.2715 1.8330 2.3254 3.4430 2.2482 2.5833 1.8414 4.2481 1.5804 1.5779 1.6597 1.9119 2.3313 6.1712 6.4230 5.9914 2.0901 2.3821 1.4652 1.6271 1.7481 1.7932 1.4943 1.5033 1.0623 1.0510 1.4637 1.4754 2.6448 6.7113 2.7177 2.1828 4.7736 6.1778 5.1154 6.2876 6.2153 6.4503 6.4456 6.1388 1.0326 1.0326 1.0876 1.0876 1.1041 1.1041 1.0997 1.0997 1.0871 1.0854 1.0853 1.0897 1.0897 1.0942 1.0937 1.0937 1.0995 1.0995 1.0937 1.0960 1.0732 1.0731
irintensity: 0.0012 0.2418 1.9519 0.3853 0.0001 0.0199 1.3870 0.0037 9.6418 0.0073 0.6089 8.0559 0.0080 0.2097 5.3162 22.2119 0.0004 2.0039 2.9476 0.0162 25.6517 0.4937 4.4767 3.0462 7.3508 1.3414 0.0001 0.0250 0.3494 0.0098 66.7221 1.9626 1.1285 0.0002 27.9511 13.9504 0.1319 1.3232 59.9101 5.7180 0.0108 0.0010 0.5207 9.2754 23.6257 6.1655 0.1491 5.9864 0.0055 0.0589 0.2502 0.2737 152.4287 0.0063 22.1016 20.5687 10.4695 143.9698 10.3387 73.2644 0.0135 96.6034 9.0198 0.0183 0.9899 1.0778 0.0415 0.0006 33.6199 0.7676 41.9398 0.0682 0.3764 0.0002 114.4213 47.6591 7.8967 0.0030 13.3865 26.2066 0.4642 9.6888 24.5731 285.4327 2.5733 14.1278 0.1417 0.1440 308.0322 0.4885 11.7373 155.9378 10.4086 4.0174 0.5743 44.8682 54.2262 84.9444 476.1379 120.2223 319.4560 4.1440 6.6977 2.8065 176.4136 60.7787 217.2952 2.0295 107.9122 0.4383 269.3229 43.0519 51.9109 14.8714 106.4408 14.9185 140.1288 46.3017 11.9079 17.8245 0.1632 19.4647 10.4131 405.2580 2.3141 1184.7190 171.9934 14.2623 0.4385 17.0904 6.9305 25.2727 32.8393 13.0408 166.6753 74.6087 38.2893 36.6793 44.1983 47.1618 18.0310 21.2256 16.9283 0.5655 0.4852 11.0740 11.8489 16.6832 29.7379 23.4009 43.9667 24.2654 19.0765 22.2400 1.5048 10.2377
temp: 298.150 k
press: 1.00000 atm
elementType: 8 8 7 7 7 7 7 7 6 6 6 6 6 6 6 6 6 6 6 6 6 6 6 6 6 6 6 6 6 6 6 6 1 1 1 1 1 1 1 1 1 1 1 1 1 1 1 1 1 1 1 1 1 1
symmnumber: 1
zpe: 1094771.3 jmol-1
zpe.correction: 0.416976 hartree
zpe.thermalcorrener: 0.445400 hartree
zpe.thermalcorrenthalpy: 0.446344 hartree
zpe.thermalcorrgfe: 0.353309 hartree
zpe.sumelectzpe: -1404.360281 hartree
zpe.sumelectthermal: -1404.331857 hartree
zpe.sumelectthermalent: -1404.330913 hartree
zpe.sumelectthermalfe: -1404.423948 hartree
dipole: 0.0025 0.6731 0.0733
dipole: 0.6771
quadrupole: -82.5800 -169.6894 -196.4439
quadrupole: 0.0046 -0.1203 -0.1608
quadrupole: 66.9911 -20.1183 -46.8728 0.0046 -0.1203 -0.1608
hfenergy: -1404.777257 hartree
pointgroup: C01 [X(C24H22N6O2)]
dipole: 0.0252168 -0.2534911 0.0779528 debye
polarizability: 997.9970869|72.7476153|364.5533067|27.6631412|-41.2360346|135.9373738 unknown
InChI: InChI=1S/C24H22N6O2/c1-31-21-13-7-3-9-17(21)15-25-27-23-19-11-5-6-12-20(19)24(30-29-23)28-26-16-18-10-4-8-14-22(18)32-2/h3-16,27-28H,1-2H3
charge 0 multiplicity 1
54 atoms
O  7.225855 2.760624 -0.218128
O  -7.794399 1.085529 -0.610894
N  2.502915 1.719993 -0.279888
N  -2.962071 1.114916 -0.40725
N  0.353815 2.399213 -0.508072
N  -1.005069 2.248887 -0.539873
N  3.588503 0.910126 -0.069594
N  -3.851855 0.083651 -0.254278
C  0.65159 -0.012612 -0.027602
C  -0.790383 -0.171808 -0.059604
C  1.161317 1.324387 -0.264281
C  -1.568588 1.022576 -0.326746
C  1.471228 -1.155072 0.2303
C  -1.351757 -1.466372 0.169275
C  0.891467 -2.410311 0.45002
C  -0.522552 -2.566148 0.420018
C  6.004122 0.716517 0.090605
C  -6.169781 -0.640866 -0.227465
C  7.2744 1.379212 0.038858
C  -7.550302 -0.27467 -0.352311
C  4.780681 1.487645 -0.118916
C  -5.13774 0.383853 -0.370593
C  5.99356 -0.682258 0.34846
C  -5.864363 -2.005346 0.033375
C  8.476219 0.661018 0.238128
C  -8.572732 -1.242449 -0.218605
C  7.187109 -1.402065 0.54755
C  -6.878386 -2.972932 0.167119
C  8.429922 -0.728419 0.491897
C  -8.234407 -2.589662 0.041034
C  8.492206 3.49391 -0.272045
C  -9.186187 1.519766 -0.745487
H  2.553084 -1.016281 0.250325
H  -2.437665 -1.566821 0.141916
H  1.532313 -3.277001 0.646542
H  -0.967061 -3.552408 0.593717
H  2.616043 2.730923 -0.469062
H  -3.284957 2.077488 -0.60656
H  4.898689 2.566643 -0.317328
H  -5.480624 1.411827 -0.578401
H  5.023995 -1.188275 0.388539
H  -4.810542 -2.285183 0.127413
H  9.443903 1.169211 0.19795
H  -9.625247 -0.960546 -0.313842
H  7.15294 -2.478549 0.744618
H  -6.618037 -4.017356 0.367696
H  9.364293 -1.279391 0.645227
H  -9.030807 -3.334911 0.143648
H  8.21079 4.53721 -0.477011
H  9.031264 3.435099 0.6932
H  9.141429 3.115775 -1.085286
H  -9.13142 2.60044 -0.942548
H  -9.68603 1.010779 -1.592223
H  -9.755397 1.338792 0.186762
