program: Gaussian 09
title: 000266237
version: EM64L-G09RevD.01
frameworkgroup: C1[X(C26H26N6O2)]
method: RPBEPBE
basis: SDD
operation: Freq
keyword: #p
keyword: freq=noraman
keyword: PBEPBE/SDD
title: #p freq=noraman PBEPBE/SDD
converged: YES YES NO NO
title: Mulliken charges:
elementType: O O N N N N N N C C C C C C C C C C C C C C C C C C C C C C C C C C H H H H H H H H H H H H H H H H H H H H H H H H H H
charge: -0.289193 -0.289195 -0.381902 -0.381901 -0.154605 -0.154606 0.007050 0.007050 0.168924 0.168925 0.095974 0.095974 -0.315537 -0.315539 -0.253318 -0.253316 0.277637 0.277635 0.236080 0.236081 -0.400094 -0.400094 -0.345397 -0.345397 -0.356464 -0.356465 -0.249300 -0.249301 -0.236835 -0.236833 -0.241629 -0.241628 -0.685161 -0.685160 0.299334 0.299333 0.229967 0.229967 0.302867 0.302868 0.250332 0.250333 0.249203 0.249203 0.244167 0.244167 0.226946 0.226946 0.225559 0.225558 0.210538 0.210486 0.210532 0.210492 0.232218 0.209974 0.232180 0.209974 0.232218 0.232180
chargesum: 0.00000
title: Mulliken charges with hydrogens summed into heavy atoms:
elementType: O O N N N N N N C C C C C C C C C C C C C C C C C C C C C C C C C C
charge: -0.289193 -0.289195 -0.079034 -0.079034 -0.154605 -0.154606 0.007050 0.007050 0.168924 0.168925 0.095974 0.095974 -0.016203 -0.016207 -0.023350 -0.023349 0.277637 0.277635 0.236080 0.236081 -0.149761 -0.149761 -0.096194 -0.096194 -0.112297 -0.112298 -0.022355 -0.022355 -0.011277 -0.011275 0.179395 0.179396 -0.010789 -0.010788
polarizability: 1.03517878e+03 -1.29930998e-04 3.99904099e+02 -5.38917821e-01 -2.50921161e-02 1.44709787e+02
1716.lowfreq: -2.7660 -1.6356 -1.5002 -0.0019 0.0003 0.0021 7.5383 10.5914 13.5388
frequency: 7.2974 10.3141 13.3126 22.0234 36.1205 42.8182 66.8594 67.0131 75.3466 78.2069 91.1994 102.6480 116.8111 117.0440 137.5914 143.3310 148.5912 177.4863 183.4947 185.5491 211.2238 221.9601 229.4814 244.7475 245.9744 247.7815 250.9972 286.6500 310.9625 319.5803 320.1172 336.4320 346.6890 374.1812 396.8166 406.6689 422.3543 456.5367 476.0205 476.1197 478.4813 493.0848 504.8342 511.5015 545.0936 545.2865 580.2171 593.0970 596.2483 617.6611 627.4965 649.4232 652.5864 662.9264 701.1630 724.6160 728.0254 740.9378 741.3007 754.4521 754.5298 758.2102 768.0193 779.3463 782.0582 790.8176 794.7491 827.7710 827.7877 857.7791 857.9020 868.2313 890.0171 907.9914 908.8033 910.8678 931.8324 931.8968 942.5237 942.7920 977.7769 978.0308 1002.5289 1016.6223 1028.1168 1035.5093 1035.7340 1044.2385 1044.6128 1063.2515 1065.5358 1092.0083 1096.6146 1108.9760 1116.9527 1118.4323 1136.8097 1136.8125 1141.6933 1166.2829 1172.2695 1173.6526 1174.1797 1196.7219 1202.3530 1225.5280 1237.7179 1239.5163 1251.7100 1263.1156 1263.1205 1271.6595 1294.1942 1295.3604 1312.1847 1323.9959 1331.8172 1364.8494 1366.9837 1374.4749 1389.1146 1389.9927 1401.2844 1401.3761 1411.3120 1428.1131 1439.1898 1440.5050 1462.5814 1462.5839 1469.1051 1469.3709 1480.7478 1481.0787 1486.5196 1493.0851 1493.6233 1509.5827 1531.8131 1532.8342 1545.9868 1546.7620 1564.4585 1585.0652 1585.3094 1604.6097 1604.6261 1616.6822 2958.4930 2958.5546 2997.4394 2997.4581 3017.5256 3017.5333 3042.1569 3042.2712 3094.6659 3094.6872 3106.2813 3106.2888 3130.8216 3132.7329 3132.7462 3148.4148 3148.4187 3151.8519 3163.8936 3163.9064 3173.5649 3173.6406 3184.6470 3187.8505 3353.1271 3353.4107
redmass: 4.3954 6.5258 5.2346 5.3428 5.2580 5.0992 3.8483 3.7364 4.2212 4.7070 3.2088 4.5984 1.9798 2.0710 6.4722 3.9090 5.7498 3.6860 4.2489 4.1766 3.8998 4.0556 3.3128 1.6438 1.2998 2.4619 6.3012 5.5673 4.8814 4.2233 4.1229 3.8857 4.1560 9.5662 5.3807 6.6968 3.4823 4.6365 3.1020 3.0929 6.7755 5.8126 5.6273 7.1134 3.5520 3.5696 7.1845 6.4944 6.6682 3.5078 6.9837 6.6685 4.0474 6.8146 5.5780 1.3028 1.3560 3.3746 3.1914 1.2741 1.2738 4.7862 4.4256 7.7884 5.6423 1.3351 5.5901 1.1236 1.1230 1.3819 1.3796 4.1667 4.2807 3.3714 3.4681 1.3864 1.4357 1.4371 1.4367 1.4333 1.3329 1.3324 1.3511 1.3132 2.9014 2.8002 2.8073 2.1078 2.0931 5.8331 4.2629 2.7921 3.0125 3.0128 2.1883 2.1441 1.4334 1.4335 2.2751 2.0778 1.1025 1.2083 1.1593 1.9439 2.5424 3.3669 2.2108 2.5772 1.8375 1.1422 1.1422 4.2952 1.5658 1.5549 1.6472 1.9296 2.3438 1.5991 1.3584 3.4871 4.6892 4.5908 1.3121 1.3167 2.0894 2.9138 2.4196 2.4691 1.0401 1.0401 1.9013 1.9621 1.1482 1.1400 2.4032 1.1765 1.2221 6.5107 2.7281 2.1761 4.8051 6.1825 5.1097 6.2844 6.2108 6.4082 6.3870 6.1397 1.0553 1.0554 1.0363 1.0363 1.1075 1.1076 1.0876 1.0876 1.0988 1.0988 1.1015 1.1015 1.0871 1.0853 1.0853 1.0898 1.0898 1.0942 1.0938 1.0939 1.0992 1.0991 1.0938 1.0960 1.0732 1.0731
irintensity: 0.0000 0.2075 1.5925 0.3414 0.0000 0.0144 1.9133 0.0002 0.6109 0.2748 0.0005 1.9859 7.7806 0.0007 0.1876 0.0004 1.0120 20.9689 11.4536 0.9525 0.0002 1.4621 0.0003 14.8906 0.0000 12.4272 1.6869 10.0621 0.1739 0.0005 0.0598 7.2161 2.3677 0.0001 48.7414 1.4037 1.1200 0.0000 14.7324 0.0009 38.2481 0.0199 59.7933 4.4689 0.0056 0.0000 2.2134 9.2085 22.4114 6.0642 0.1843 7.1106 0.0017 0.0246 0.4210 0.0013 153.2258 0.0002 17.6012 0.0161 159.1735 19.3427 9.0241 75.5034 0.0001 95.7959 3.8542 0.0172 3.0211 0.0003 0.0370 0.5887 14.7364 41.1343 74.9859 0.0007 36.2729 0.0001 37.0366 0.0003 0.4227 0.0001 7.8077 0.0009 14.0877 151.7557 52.7305 26.2060 3.2680 15.3905 27.7283 304.7213 6.5814 16.2753 81.4831 7.5905 3.1791 6.1796 303.2731 154.2332 19.1392 7.9737 5.3541 80.3947 79.0705 131.2509 519.8035 142.4641 323.9996 0.0159 0.0216 1.6282 9.5731 3.6057 148.7067 75.7069 248.7618 7.2145 1.6728 0.0898 127.5513 0.1592 16.2017 61.3130 257.8022 24.9706 163.6039 65.7348 1.3258 23.7067 99.2807 12.2544 0.5680 24.7726 9.3197 6.0665 1.2973 411.0851 0.1056 1182.9911 172.8122 12.2737 0.6333 14.2805 9.3374 3.8318 65.7516 13.3248 150.0668 0.3524 11.3816 39.3668 2.1953 64.7863 40.6971 35.3544 76.6779 1.3431 1.9054 66.7124 17.1939 0.8684 0.3870 7.1656 20.0639 16.7776 31.8618 24.0556 57.2345 13.9369 19.6132 22.8921 0.1150 10.5032
temp: 298.150 k
press: 1.00000 atm
elementType: 8 8 7 7 7 7 7 7 6 6 6 6 6 6 6 6 6 6 6 6 6 6 6 6 6 6 6 6 6 6 6 6 6 6 1 1 1 1 1 1 1 1 1 1 1 1 1 1 1 1 1 1 1 1 1 1 1 1 1 1
symmnumber: 1
zpe: 1241055.9 jmol-1
zpe.correction: 0.472693 hartree
zpe.thermalcorrener: 0.503984 hartree
zpe.thermalcorrenthalpy: 0.504928 hartree
zpe.thermalcorrgfe: 0.405166 hartree
zpe.sumelectzpe: -1482.819702 hartree
zpe.sumelectthermal: -1482.788412 hartree
zpe.sumelectthermalent: -1482.787468 hartree
zpe.sumelectthermalfe: -1482.887230 hartree
dipole: 0.0000 -0.1346 0.0023
dipole: 0.1346
quadrupole: -95.6025 -180.2887 -208.8773
quadrupole: -0.0002 0.2530 0.0035
quadrupole: 65.9870 -18.6992 -47.2878 -0.0002 0.2530 0.0035
hfenergy: -1483.2923955 hartree
pointgroup: C01 [X(C26H26N6O2)]
dipole: -0.0000006 -0.0529572 0.0008428 debye
polarizability: 1035.1076616|0.0842756|399.9038364|7.9749188|0.2667981|144.7811635 unknown
InChI: InChI=1S/C26H26N6O2/c1-3-33-23-15-9-5-11-19(23)17-27-29-25-21-13-7-8-14-22(21)26(32-31-25)30-28-18-20-12-6-10-16-24(20)34-4-2/h5-18,29-30H,3-4H2,1-2H3
charge 0 multiplicity 1
60 atoms
O  7.558494 1.266669 0.084542
O  -7.558957 1.264635 -0.081077
N  2.749695 0.74491 0.0253
N  -2.749987 0.744148 -0.025346
N  0.683461 1.673952 0.006853
N  -0.684026 1.673761 -0.005379
N  3.744941 -0.197901 0.030059
N  -3.74496 -0.198942 -0.031589
C  0.725678 -0.80283 0.004905
C  -0.725512 -0.803032 -0.008064
C  1.373575 0.494696 0.011984
C  -1.373793 0.494313 -0.012653
C  1.420783 -2.051918 0.010009
C  -1.420247 -2.052314 -0.015572
C  0.711908 -3.259176 0.002561
C  -0.711012 -3.259374 -0.010455
C  6.129111 -0.664206 0.0488
C  -6.129002 -0.665902 -0.050426
C  7.461644 -0.134859 0.069591
C  -7.461699 -0.136896 -0.069273
C  4.991365 0.253087 0.043996
C  -4.99152 0.25171 -0.044222
C  5.972511 -2.077914 0.033206
C  -5.971981 -2.079595 -0.038052
C  8.582751 -0.998053 0.074375
C  -8.582559 -1.000402 -0.075292
C  7.085312 -2.940303 0.037958
C  -7.084534 -2.942295 -0.044061
C  8.391934 -2.397753 0.05856
C  -8.391324 -2.400079 -0.062689
C  8.903793 1.87495 0.107123
C  -8.904443 1.872587 -0.101356
C  8.705281 3.388175 0.119779
C  -8.706362 3.385891 -0.110847
H  2.511463 -2.031843 0.019755
H  -2.510933 -2.032545 -0.025258
H  1.258027 -4.209028 0.006697
H  -1.25685 -4.209378 -0.016427
H  2.968588 1.756124 0.030045
H  -2.969177 1.755305 -0.028122
H  5.220779 1.332452 0.052658
H  -5.221251 1.331023 -0.050653
H  4.954749 -2.479907 0.016905
H  -4.954092 -2.481324 -0.023225
H  9.599179 -0.595242 0.090286
H  -9.599113 -0.597854 -0.089695
H  6.939957 -4.025455 0.025578
H  -6.93886 -4.027429 -0.034167
H  9.264608 -3.060101 0.062315
H  -9.263809 -3.062671 -0.067389
H  9.446445 1.531837 1.011688
H  9.468658 1.549974 -0.790541
H  -9.447657 1.531313 -1.006281
H  -9.468563 1.545478 0.795999
H  8.134893 3.699988 1.011274
H  9.685914 3.897556 0.136442
H  8.156199 3.717617 -0.778724
H  -9.687147 3.895031 -0.125857
H  -8.136573 3.699778 -1.001997
H  -8.156858 3.71356 0.788047
