program: Gaussian 09
title: 000266226
version: EM64L-G09RevD.01
frameworkgroup: C1[X(C15H20ClN3O2)]
method: RPBEPBE
basis: SDD
operation: Freq
keyword: #p
keyword: freq=noraman
keyword: PBEPBE/SDD
title: #p freq=noraman PBEPBE/SDD
converged: YES YES NO NO
title: Mulliken charges:
elementType: Cl O O N N N C C C C C C C C C C C C C C C H H H H H H H H H H H H H H H H H H H H
charge: -0.084084 -0.283562 -0.296395 -0.134192 -0.486225 -0.412586 -0.400717 -0.377207 -0.381889 -0.398295 -0.391551 0.126282 0.279842 -0.385177 -0.315817 0.486712 -0.345855 -0.477156 0.296874 -0.325178 -0.551398 0.222147 0.188387 0.208968 0.201451 0.221481 0.202015 0.250309 0.199701 0.204527 0.262324 0.263294 0.249989 0.308586 0.217236 0.292689 0.271301 0.245910 0.297559 0.280131 0.269569
chargesum: 0.00000
title: Mulliken charges with hydrogens summed into heavy atoms:
elementType: Cl O O N N N C C C C C C C C C C C C C C C
charge: -0.084084 -0.283562 -0.296395 -0.134192 -0.193536 -0.115027 0.009817 0.033213 0.041607 0.051715 0.075299 0.126282 0.279842 -0.121883 -0.065829 0.486712 -0.037269 -0.259921 0.296874 0.192033 -0.001698
polarizability: 3.26998095e+02 8.59269630e-02 1.67082544e+02 -8.35977074e-01 -2.61366310e+01 1.46720399e+02
1716.lowfreq: -8.6911 -2.3124 -0.0007 -0.0004 0.0013 6.4083 11.2177 23.7783 35.8058
frequency: -2.1767 23.4870 35.4454 47.6402 61.2567 64.8866 66.9204 87.4808 106.5320 112.4443 167.6360 173.4229 213.1726 234.7089 255.2423 276.0397 320.0584 325.0617 354.3120 373.6372 395.0699 406.1887 410.3170 414.4419 443.8766 471.7561 487.4287 526.1230 575.9328 588.6892 608.6418 612.7528 625.4884 676.1394 693.9929 704.9132 718.3077 756.9355 799.8728 811.9583 825.2436 830.2973 846.8989 858.7828 872.5502 881.4623 912.4835 947.4936 957.5755 962.8049 989.1555 993.9263 995.7854 1010.8489 1037.2923 1041.6466 1086.8030 1096.4845 1120.7928 1125.4308 1129.9376 1152.4087 1167.2973 1176.0353 1192.9798 1211.7677 1229.0496 1235.7473 1252.4702 1263.1074 1273.6501 1281.6487 1296.7720 1308.8051 1329.0374 1335.4216 1341.0889 1348.9016 1359.3684 1363.2278 1371.0125 1409.6292 1417.0686 1439.6536 1447.3117 1452.4855 1454.3457 1463.1981 1464.6454 1472.8027 1479.8621 1498.8436 1516.8451 1547.2031 1589.7907 1621.3226 1644.9211 2954.1594 2961.7915 2965.0488 2982.4249 2990.0969 2993.2989 3035.2521 3045.1935 3051.9461 3056.0222 3066.1109 3090.7193 3096.3966 3107.4377 3145.2519 3154.7242 3155.8539 3196.7989 3522.9537 3543.1784
redmass: 6.7060 5.1028 4.6684 5.2405 5.5213 4.7244 4.2875 5.4264 5.9262 3.9220 4.8126 2.9200 4.9297 4.0014 3.0837 2.5318 2.8113 3.5787 4.3765 3.1488 2.4212 1.8301 2.2467 3.0014 3.0640 3.1284 2.8203 2.2842 2.3936 3.8817 1.6105 2.7345 6.5880 4.0513 6.3192 10.5294 4.2645 4.2587 1.5073 3.1821 3.2639 1.5167 1.4926 2.5022 1.7443 2.3607 2.7430 1.3295 1.3642 2.3359 2.5536 2.8778 1.3615 2.6623 2.1373 1.9126 1.4432 2.1936 2.3237 1.6155 2.2206 1.2971 1.4468 2.2489 1.1295 1.5315 2.3614 1.4148 1.3726 1.6126 2.2983 1.2257 1.1910 1.3768 1.2749 1.3885 1.4597 1.4476 2.4799 1.4008 1.6689 2.4434 4.1551 1.1057 1.1033 1.1275 1.0886 1.0856 1.0965 1.1068 1.6958 2.2411 3.1265 7.1466 5.4776 5.7662 4.4172 1.0699 1.0687 1.0645 1.0608 1.0610 1.0599 1.0960 1.1027 1.0957 1.1029 1.0629 1.0941 1.0926 1.0887 1.0947 1.1121 1.0910 1.0948 1.0763 1.0771
irintensity: 0.6089 1.6049 1.1669 3.6713 5.1313 0.5328 0.1845 7.6730 5.0688 6.0927 0.1308 1.2800 1.1865 10.3972 0.9716 2.8384 24.6185 2.6759 2.1520 18.0169 3.2679 6.4997 9.8096 2.6113 1.4219 3.0768 25.0470 33.2622 12.1079 18.9195 123.1970 48.0075 7.2050 7.6925 22.6707 8.9784 9.8619 8.1728 1.3909 12.8095 0.5226 29.8193 25.4630 15.8817 33.9128 25.1896 1.0927 6.1599 4.4871 11.2973 6.1550 70.3067 2.3239 3.6494 1.5830 5.5313 2.9859 45.3319 9.8042 15.9220 2.8556 0.6968 12.5574 3.9429 83.1946 151.9783 19.1108 396.3229 30.7983 145.4943 36.2560 39.8000 35.7932 47.2536 0.4950 3.6225 11.9100 3.3311 110.1390 59.8311 45.5181 235.5322 49.8540 7.5234 42.0121 38.3868 5.0234 13.0711 5.5314 11.7231 94.3733 449.5014 475.5994 188.2661 97.1218 109.9558 152.1777 28.2748 48.6012 65.6415 27.3140 35.7141 60.2070 63.1815 38.3716 6.6178 80.5804 22.4645 6.6902 17.4502 22.3376 13.3434 16.8974 1.1730 5.0647 4.8219 45.8952
temp: 298.150 k
press: 1.00000 atm
elementType: 17 8 8 7 7 7 6 6 6 6 6 6 6 6 6 6 6 6 6 6 6 1 1 1 1 1 1 1 1 1 1 1 1 1 1 1 1 1 1 1 1
symmnumber: 1
zpe: 879711.6 jmol-1
zpe.correction: 0.335064 hartree
zpe.thermalcorrener: 0.354679 hartree
zpe.thermalcorrenthalpy: 0.355623 hartree
zpe.thermalcorrgfe: 0.284735 hartree
zpe.sumelectzpe: -1356.825354 hartree
zpe.sumelectthermal: -1356.805739 hartree
zpe.sumelectthermalent: -1356.804795 hartree
zpe.sumelectthermalfe: -1356.875683 hartree
dipole: 1.3180 5.0889 -1.2835
dipole: 5.4112
quadrupole: -114.8307 -143.9041 -126.0560
quadrupole: -20.8673 -0.0254 -3.0039
quadrupole: 13.4329 -15.6405 2.2076 -20.8673 -0.0254 -3.0039
hfenergy: -1357.1604181 hartree
pointgroup: C01 [X(C15H20Cl1N3O2)]
dipole: -0.495257 1.1356544 1.7312991 debye
polarizability: 326.700586|5.2976635|132.0626023|-5.1108337|12.6275759|182.0378491 unknown
InChI: InChI=1S/C15H20ClN3O2/c16-8-9-17-15(21)18-13-6-4-12(5-7-13)14(20)19-10-2-1-3-11-19/h4-7,17-18H,1-3,8-11H2
charge 0 multiplicity 1
41 atoms
Cl -7.684704 1.067005 1.470131
O  3.285727 -1.495909 -1.451417
O  -3.73497 -0.367122 -1.691743
N  3.808014 -0.006553 0.267389
N  -2.786484 -0.457802 0.474977
N  -5.109773 -0.377239 0.197306
C  5.768163 2.180219 0.279329
C  4.250941 2.448267 0.411051
C  6.016827 0.877851 -0.517733
C  3.513401 1.231099 1.026168
C  5.253209 -0.305177 0.119456
C  2.895364 -0.706473 -0.527161
C  1.423886 -0.554576 -0.240123
C  0.519991 -0.537398 -1.331986
C  0.889413 -0.56793 1.074518
C  -1.397536 -0.49049 0.181005
C  -0.873551 -0.490541 -1.141145
C  -0.50078 -0.542619 1.284217
C  -3.860044 -0.39738 -0.430205
C  -6.342297 -0.313649 -0.587436
C  -7.133745 0.972199 -0.351317
H  6.269263 3.037169 -0.20883
H  6.213114 2.081929 1.292005
H  3.822527 2.656892 -0.589015
H  4.062882 3.337302 1.043846
H  5.676065 1.003295 -1.563472
H  7.097165 0.639134 -0.548725
H  2.428059 1.410822 1.027375
H  3.841702 1.097449 2.079081
H  5.666333 -0.512906 1.128952
H  5.340008 -1.212722 -0.498638
H  0.928958 -0.57862 -2.346822
H  1.561026 -0.634921 1.937696
H  -1.561207 -0.466125 -1.987807
H  -0.89389 -0.57186 2.309011
H  -3.017169 -0.496513 1.470262
H  -6.039559 -0.355677 -1.651391
H  -6.983693 -1.190715 -0.378048
H  -5.20348 -0.336148 1.214048
H  -6.530736 1.876395 -0.516194
H  -8.067023 0.99824 -0.932918
