program: Gaussian 09
title: 000266223
version: EM64L-G09RevD.01
frameworkgroup: C1[X(C11H14N4O3)]
method: RPBEPBE
basis: SDD
operation: Freq
keyword: #p
keyword: freq=noraman
keyword: PBEPBE/SDD
title: #p freq=noraman PBEPBE/SDD
converged: YES YES NO NO
title: Mulliken charges:
elementType: O O O N N N N C C C C C C C C C C C H H H H H H H H H H H H H H
charge: -0.263632 -0.469030 -0.434959 -0.170452 -0.060433 -0.020827 -0.046043 -0.083788 -0.120735 -0.509063 -0.061573 -0.371544 0.155309 -0.236060 -0.096884 0.168286 -0.386632 -0.752258 0.280318 0.260935 0.255767 0.270849 0.234088 0.207912 0.224111 0.337272 0.352269 0.357309 0.246870 0.241011 0.249987 0.241621
chargesum: 0.00000
title: Mulliken charges with hydrogens summed into heavy atoms:
elementType: O O O N N N N C C C C C C C C C C C
charge: -0.263632 -0.116761 -0.077650 -0.170452 -0.060433 -0.020827 -0.046043 0.196530 0.140200 0.017552 0.172514 0.060479 0.155309 0.101212 -0.096884 0.168286 -0.139762 -0.019639
polarizability: 2.05873413e+02 9.14660534e+00 1.50332687e+02 5.39921776e+00 -1.15065417e+01 1.00077668e+02
1716.lowfreq: -2.4320 -0.0006 -0.0006 -0.0004 8.0071 14.3791 16.7312 31.5554 43.6802
frequency: 13.9082 30.9391 43.6323 62.3657 89.9331 118.6641 138.7115 152.8524 185.5682 229.7671 254.8871 269.5670 280.2622 290.6477 292.4434 361.0647 401.9695 440.7329 485.0086 507.5125 532.5063 543.2017 576.1836 621.1143 634.4593 653.3735 659.5158 678.6399 695.5387 783.0723 803.6343 813.2454 840.5689 846.7058 880.4235 913.0113 920.9632 923.1389 935.5363 945.6676 962.6850 994.3033 1033.5140 1042.8133 1043.9023 1054.7628 1079.5949 1115.0539 1148.7660 1164.5020 1181.7122 1183.3029 1221.4495 1230.4604 1245.2465 1269.1940 1270.1647 1289.7938 1296.6922 1308.3603 1311.6950 1315.0472 1342.9604 1364.0726 1366.6206 1379.2751 1391.9023 1404.0515 1414.7005 1449.4447 1455.3654 1456.4863 1460.2487 1461.6441 1543.7826 1563.5469 2980.2255 2991.6850 2995.8263 3022.9873 3050.2272 3069.5122 3074.4600 3082.7175 3118.2201 3125.9852 3169.2185 3203.4937 3537.7085 3579.1834
redmass: 1.0235 5.1194 5.7929 5.1798 4.8538 4.5376 5.0893 5.8862 5.9452 4.7285 2.9379 3.2725 1.2099 4.7357 2.8316 4.1899 2.5026 3.2550 1.3502 6.8950 3.8768 4.5304 4.5447 4.4932 4.9563 6.2681 5.7651 5.9396 6.3933 5.1367 6.3993 2.9848 3.5763 7.7419 3.3929 1.3344 2.5372 1.4618 3.3878 3.6028 2.4514 2.3920 2.3678 1.6038 3.0330 3.1819 1.9541 3.2210 3.0149 1.4273 1.2988 1.1783 1.9293 1.5453 2.5168 1.4663 3.4368 1.7268 3.6275 1.3694 2.0654 1.6086 1.4434 5.4760 1.3939 1.3038 1.2896 1.4677 1.5063 3.3521 1.0494 1.0952 1.1792 1.0856 8.0584 9.5822 1.0723 1.0376 1.0776 1.0854 1.0641 1.0960 1.0994 1.0884 1.1039 1.0999 1.0922 1.1020 1.0651 1.0665
irintensity: 0.6728 1.5751 0.3336 1.2082 8.2276 8.3581 0.3296 1.8272 2.7582 0.5396 7.3486 0.6363 145.7499 9.3991 12.2333 6.2576 29.4952 32.6728 189.6325 11.3779 1.3402 2.5262 12.4860 4.4167 33.2030 13.9002 6.8610 32.8196 0.6831 27.7313 1.8381 17.0671 30.3973 9.6089 33.4906 28.2330 11.5920 10.6641 96.0984 51.1555 44.0791 28.3707 58.9746 8.3033 42.2832 28.4121 15.2405 9.1254 5.4803 24.6629 66.2386 50.5406 134.6450 46.5076 47.1368 21.6782 3.5147 8.8935 4.1354 2.3653 63.3051 1.8315 30.1823 58.4005 9.5088 10.0190 22.1358 26.7380 5.5514 41.1419 17.7968 13.6586 38.3833 7.9890 43.1559 141.6453 14.4435 6.7508 70.4121 19.9049 10.6136 11.0534 25.8279 6.2061 7.5219 11.8238 16.0576 53.4976 6.8655 9.5812
temp: 298.150 k
press: 1.00000 atm
elementType: 8 8 8 7 7 7 7 6 6 6 6 6 6 6 6 6 6 6 1 1 1 1 1 1 1 1 1 1 1 1 1 1
symmnumber: 1
zpe: 655969.3 jmol-1
zpe.correction: 0.249846 hartree
zpe.thermalcorrener: 0.266185 hartree
zpe.thermalcorrenthalpy: 0.267129 hartree
zpe.thermalcorrgfe: 0.203655 hartree
zpe.sumelectzpe: -870.884103 hartree
zpe.sumelectthermal: -870.867764 hartree
zpe.sumelectthermalent: -870.866819 hartree
zpe.sumelectthermalfe: -870.930294 hartree
dipole: 4.2336 1.8800 0.0724
dipole: 4.6328
quadrupole: -110.4305 -108.7523 -101.3015
quadrupole: 7.4126 -2.5119 -3.8403
quadrupole: -3.6024 -1.9242 5.5266 7.4126 -2.5119 -3.8403
hfenergy: -871.1339489 hartree
pointgroup: C01 [X(C11H14N4O3)]
dipole: 1.6410477 -0.7866045 -0.1021862 debye
polarizability: 204.7220611|-11.0109064|151.2643137|-9.7875343|-10.1017241|100.2973925 unknown
InChI: InChI=1S/C11H14N4O3/c1-6-10-11(13-4-12-6)15(5-14-10)9-2-7(17)8(3-16)18-9/h4-5,7-9,16-17H,2-3H2,1H3
charge 0 multiplicity 1
32 atoms
O  1.955138 0.925804 0.35578
O  2.620362 -2.342219 -0.652337
O  4.734041 1.431269 0.043897
N  -0.097939 -0.082722 -0.500028
N  -1.596721 -1.695968 0.177341
N  -1.615387 1.876911 -0.529427
N  -3.908482 1.284865 0.130346
C  1.154755 0.606166 -0.843084
C  3.071033 -0.940503 -0.767851
C  2.112853 -0.211502 -1.737218
C  2.938497 -0.172688 0.584977
C  4.227269 0.507452 1.061368
C  -1.326827 0.567606 -0.326304
C  -0.326671 -1.439242 -0.177818
C  -2.248399 -0.44392 0.089822
C  -3.587891 -0.037768 0.322526
C  -2.930669 2.15673 -0.279361
C  -4.66617 -0.987131 0.768944
H  0.852582 1.578451 -1.263628
H  4.111507 -0.903501 -1.140259
H  2.68474 0.489551 -2.365877
H  1.592703 -0.928364 -2.391176
H  2.542335 -0.860013 1.360615
H  5.02504 -0.240027 1.214023
H  4.039263 1.03089 2.020527
H  0.477022 -2.172925 -0.238886
H  3.304516 -2.877267 -0.178347
H  4.017181 2.100402 -0.112585
H  -3.2410 3.19585 -0.421611
H  -4.409592 -1.436634 1.745993
H  -5.623517 -0.451071 0.851841
H  -4.768671 -1.825979 0.056597
