program: Gaussian 09
title: 000266220
version: EM64L-G09RevD.01
frameworkgroup: C1[X(C13H19N3O2)]
method: RPBEPBE
basis: SDD
operation: Freq
keyword: #p
keyword: freq=noraman
keyword: PBEPBE/SDD
title: #p freq=noraman PBEPBE/SDD
converged: YES YES NO NO
title: Mulliken charges:
elementType: O O N N N C C C C C C C C C C C C C H H H H H H H H H H H H H H H H H H H
charge: -0.293374 -0.235167 -0.053315 -0.027225 -0.133769 -0.006126 -0.404426 -0.702566 -0.682349 -0.627512 0.075357 0.146342 -0.321807 -0.315683 -0.210758 -0.248634 0.167225 -0.502452 0.193084 0.234391 0.214208 0.229885 0.202781 0.219955 0.207216 0.214943 0.230666 0.250498 0.279178 0.216352 0.254560 0.268239 0.226142 0.229550 0.237449 0.238947 0.228192
chargesum: 0.00000
title: Mulliken charges with hydrogens summed into heavy atoms:
elementType: O O N N N C C C C C C C C C C C C C
charge: -0.293374 -0.235167 -0.053315 -0.027225 -0.133769 0.186957 0.044174 -0.049944 -0.029523 0.118516 0.075357 0.146342 -0.067246 -0.047445 0.015384 -0.019084 0.167225 0.202136
polarizability: 2.71222164e+02 -1.83498157e+01 1.94813604e+02 -1.99198110e+01 4.84074546e+00 1.10417896e+02
1716.lowfreq: -8.8539 -0.0007 -0.0005 0.0005 5.0344 5.3250 16.7864 25.2138 39.0719
frequency: 16.6023 25.0155 39.0599 53.6586 68.7692 94.1221 102.4458 114.4445 123.6317 151.3712 179.7751 194.3621 221.1901 227.8790 241.9947 250.2879 262.2190 307.0119 317.2768 342.2560 364.1249 368.7966 400.8861 422.9124 440.0421 490.7435 536.7845 559.1986 582.5000 637.7366 676.3459 679.6905 750.2881 764.5422 771.8777 779.3979 820.4970 877.0749 884.3174 900.7085 921.2536 923.9249 957.6465 964.1916 966.7442 989.7801 1029.2556 1036.5037 1041.1899 1093.5433 1097.7479 1107.0109 1112.6522 1123.4213 1143.2550 1170.7822 1184.2007 1197.2003 1212.2969 1219.3878 1268.4228 1289.0960 1311.2062 1317.9752 1337.0942 1355.7080 1362.4312 1380.1526 1380.9689 1401.6359 1420.4583 1426.0220 1428.1596 1438.3909 1450.0931 1450.2901 1463.6778 1465.4571 1467.5747 1476.5932 1480.9408 1485.6046 1491.1446 1572.5806 1595.1410 1628.5044 2956.8950 2972.6784 2982.0562 2985.9624 2997.6080 2997.9737 3062.5323 3064.7686 3068.8359 3074.8306 3077.7820 3085.0974 3096.3902 3128.2094 3128.8107 3140.5274 3150.2887 3164.5379 3180.7919
redmass: 3.6458 3.2340 5.4100 3.1751 3.7069 2.8917 1.4700 2.9048 2.5570 2.8899 1.5343 2.5716 1.8312 1.8939 1.4125 2.5898 2.3684 3.9663 5.0935 3.8745 2.3369 4.1189 5.8253 2.6191 2.6199 4.8434 3.4997 4.3591 4.5785 5.4351 4.5059 4.5966 4.8062 3.1323 2.0412 2.6749 3.2883 2.1211 1.7509 2.0281 6.8624 1.2825 2.0450 1.5671 1.4042 1.3279 3.3239 2.6621 2.1110 1.6580 1.7588 1.5247 1.2710 1.8020 1.4473 1.0675 2.0007 2.3416 2.2593 3.6569 1.5504 2.0410 1.6332 2.5008 3.7321 1.5703 1.4488 1.2682 6.0157 1.2222 1.2658 2.0233 1.2179 1.0524 1.0689 1.1233 1.0458 1.0674 2.2362 1.0582 1.0662 1.0917 1.0599 7.2566 6.2365 10.0739 1.0814 1.0362 1.0363 1.0348 1.0548 1.0361 1.0996 1.0999 1.1012 1.0999 1.0996 1.0991 1.1040 1.0864 1.1007 1.1042 1.0908 1.0956 1.0967
irintensity: 0.0738 0.2312 2.1097 0.3605 2.3753 1.2474 1.9298 0.3438 5.4598 2.7640 0.6612 0.5765 3.6177 2.2941 2.9304 0.8780 1.3760 7.3833 1.0367 10.3814 1.4999 1.7134 1.2984 1.5018 4.9575 3.2301 6.7758 2.6052 22.1432 9.5763 1.0556 26.6384 4.7930 30.0163 52.2530 10.2488 24.7117 2.1920 3.5773 1.1997 4.3371 0.8051 4.4017 1.0212 3.5291 0.6795 265.8495 51.2751 18.0143 30.6514 20.2898 4.9570 0.3189 32.4566 59.0888 10.5734 4.0669 7.8668 4.4561 313.5319 16.7184 1.2064 0.6824 127.9825 320.4508 54.2980 17.5046 19.7199 6.4963 15.9687 20.6746 11.9761 65.3827 20.9111 26.3609 11.4157 2.8712 24.2186 69.0444 2.8246 7.7614 46.5664 18.6300 29.7531 6.2704 182.4704 32.0230 33.8435 20.7525 23.5695 105.1883 26.4191 11.1399 26.5339 24.5579 9.3649 71.4818 64.1548 29.9970 7.3786 18.5738 20.2234 16.3010 14.4624 13.3723
temp: 298.150 k
press: 1.00000 atm
elementType: 8 8 7 7 7 6 6 6 6 6 6 6 6 6 6 6 6 6 1 1 1 1 1 1 1 1 1 1 1 1 1 1 1 1 1 1 1
symmnumber: 1
zpe: 795491.1 jmol-1
zpe.correction: 0.302987 hartree
zpe.thermalcorrener: 0.322545 hartree
zpe.thermalcorrenthalpy: 0.323489 hartree
zpe.thermalcorrgfe: 0.252875 hartree
zpe.sumelectzpe: -820.062031 hartree
zpe.sumelectthermal: -820.042472 hartree
zpe.sumelectthermalent: -820.041528 hartree
zpe.sumelectthermalfe: -820.112143 hartree
dipole: 2.1787 0.1145 -0.7706
dipole: 2.3138
quadrupole: -85.6644 -97.3867 -108.1850
quadrupole: 2.6729 -5.5966 1.4297
quadrupole: 11.4143 -0.3080 -11.1063 2.6729 -5.5966 1.4297
hfenergy: -820.3650174 hartree
pointgroup: C01 [X(C13H19N3O2)]
dipole: 0.7877282 0.4432018 -0.108382 debye
polarizability: 272.6968159|21.460185|168.6455499|-18.4568374|35.7594933|135.1112982 unknown
InChI: InChI=1S/C13H19N3O2/c1-10(2)9-16(3)15-14-12-8-6-5-7-11(12)13(17)18-4/h5-8,10H,9H2,1-4H3
charge 0 multiplicity 1
37 atoms
O  -2.864289 -2.509908 -1.351132
O  -0.592542 -2.380753 -0.865622
N  2.21703 1.020036 -0.419298
N  1.016371 1.039387 0.215828
N  0.093535 0.334319 -0.41307
C  4.199305 0.799478 1.197966
C  3.319946 1.703188 0.281052
C  4.995988 -0.267964 0.411139
C  3.368387 0.154817 2.33069
C  2.393516 0.296928 -1.694088
C  -1.195385 0.426458 0.181912
C  -2.139178 -0.621662 -0.077431
C  -1.618441 1.562236 0.932462
C  -3.474095 -0.488198 0.39148
C  -2.937472 1.663158 1.408158
C  -3.876895 0.638764 1.132816
C  -1.736793 -1.876415 -0.777791
C  -2.582759 -3.79888 -2.017301
H  4.93239 1.497296 1.658551
H  2.856722 2.493683 0.897857
H  3.958652 2.188906 -0.481507
H  4.323381 -1.029854 -0.023557
H  5.587065 0.182912 -0.409125
H  5.699104 -0.793836 1.082597
H  4.0241 -0.419546 3.010955
H  2.834187 0.916926 2.926749
H  2.610719 -0.537203 1.921465
H  1.724402 0.719164 -2.466421
H  2.111346 -0.764772 -1.574179
H  3.44364 0.388671 -2.008609
H  -0.892202 2.360635 1.113746
H  -4.182335 -1.290936 0.17065
H  -3.242016 2.545326 1.983287
H  -4.908299 0.721444 1.491012
H  -2.158952 -4.522081 -1.299216
H  -1.866009 -3.656791 -2.844068
H  -3.557822 -4.139529 -2.394354
