program: Gaussian 09
title: 000266219
version: EM64L-G09RevD.01
frameworkgroup: C1[X(C12H19N5O)]
method: RPBEPBE
basis: SDD
operation: Freq
keyword: #p
keyword: freq=noraman
keyword: PBEPBE/SDD
title: #p freq=noraman PBEPBE/SDD
converged: YES YES NO NO
title: Mulliken charges:
elementType: O N N N N N C C C C C C C C C C C C H H H H H H H H H H H H H H H H H H H
charge: -0.261044 -0.055170 -0.002472 -0.151081 -0.362552 -0.504123 -0.011313 -0.397935 -0.707022 -0.692417 -0.630896 0.027355 0.207256 -0.355553 -0.338743 -0.213747 -0.246793 0.122443 0.194293 0.229279 0.210549 0.222488 0.204683 0.223178 0.206879 0.270583 0.203585 0.258346 0.248787 0.222351 0.245839 0.244376 0.228852 0.230400 0.330310 0.302131 0.296895
chargesum: 0.00000
title: Mulliken charges with hydrogens summed into heavy atoms:
elementType: O N N N N N C C C C C C C C C C C C
charge: -0.261044 -0.055170 -0.002472 -0.151081 -0.032242 0.094904 0.182980 0.041893 -0.056673 -0.011370 0.098589 0.027355 0.207256 -0.109713 -0.094367 0.015105 -0.016393 0.122443
polarizability: 2.75238177e+02 9.27845042e+00 1.75826913e+02 -1.57446834e+01 1.34889197e+00 1.14228958e+02
1716.lowfreq: -10.6751 -7.8307 -5.2989 0.0002 0.0003 0.0006 5.9135 27.7746 50.7361
frequency: -5.7656 27.1680 50.7195 62.5468 78.2753 88.3341 109.1955 112.3863 118.7759 143.5920 174.8966 213.4290 220.6456 240.4802 250.5316 257.6432 267.3385 296.2892 305.1553 321.1143 362.8688 374.6148 400.5255 407.8930 439.6450 512.1541 550.4190 562.0701 567.6338 583.0451 644.2418 676.2993 716.3449 753.3813 757.2467 769.6175 784.7976 821.0984 858.1616 880.5281 891.3405 909.4456 926.1398 950.7207 958.8249 966.0216 985.4211 1029.5831 1037.7514 1050.6679 1091.3318 1097.2849 1110.6880 1114.2687 1168.4335 1179.2374 1183.3366 1199.3795 1211.9192 1260.0694 1276.4932 1278.4087 1282.6947 1311.9553 1320.7031 1337.1296 1351.2415 1356.7802 1373.1735 1386.7081 1410.3411 1422.9105 1426.4304 1428.7970 1438.8036 1448.2311 1463.3724 1468.3723 1478.5610 1482.3520 1490.4063 1493.4239 1565.4493 1592.1591 1606.6681 1675.1172 2955.2649 2972.5657 2979.7263 2981.0074 2988.6515 3060.1194 3064.1525 3067.6051 3069.6919 3077.4998 3086.1661 3123.0322 3126.5443 3136.7487 3154.8020 3169.1974 3378.9545 3493.2620 3548.7108
redmass: 3.9792 3.9229 2.6853 3.9478 3.8162 2.6584 3.0168 2.5654 2.5117 2.7364 1.1677 4.8045 2.1866 1.3634 2.7120 1.5052 2.4009 4.4840 4.9300 3.8602 3.6277 2.2665 4.5514 2.4775 2.9409 3.6715 3.9084 2.5046 2.6704 1.8933 5.8725 4.2465 6.2243 2.4509 3.8187 1.5571 1.7327 3.3166 6.0901 1.4600 1.7837 3.1674 1.3092 1.3911 2.1205 1.5599 1.3248 2.5198 2.0450 2.8885 1.4665 1.7736 1.5820 1.9758 1.0722 2.0498 3.0435 2.6091 2.0275 1.7329 1.4932 2.0677 1.3906 2.6304 1.5704 3.6252 1.7307 1.6023 4.4290 1.2162 1.2112 1.6202 1.7657 1.5060 1.0567 1.1634 2.5928 1.0543 1.0537 1.0872 1.0571 1.0557 6.3747 7.6068 6.7082 1.0633 1.0815 1.0366 1.0378 1.0365 1.0621 1.0976 1.0989 1.0994 1.0993 1.0987 1.1001 1.1008 1.0862 1.0893 1.0939 1.1004 1.0428 1.0978 1.0797
irintensity: 0.0900 0.3135 0.3926 0.7505 0.7478 4.5212 16.1639 11.4547 1.9880 0.9468 0.2288 2.1851 2.7146 1.7366 1.0244 0.4956 8.6240 10.5452 4.9131 7.6098 4.3560 0.1704 3.8317 1.4644 3.7595 11.9010 13.1111 33.7056 24.3582 108.1790 1.9605 7.0908 6.2354 53.2430 5.1183 59.2994 90.8785 12.5813 26.4303 3.0582 7.0093 2.6283 1.1468 2.4426 2.9610 0.7077 0.2725 45.1440 13.0741 2.7191 30.1089 15.9707 1.3459 22.6048 1.5344 5.5563 3.1617 7.0537 9.6733 22.9174 18.6055 1.2689 15.2250 53.8787 15.1427 285.8848 33.6488 0.7839 91.9290 15.3041 13.8927 88.8463 157.3079 3.7834 24.8101 14.6796 45.3295 3.2963 2.7577 14.7825 63.4988 16.1051 6.4285 145.7792 37.9491 21.1494 22.2319 29.9741 36.8495 25.5350 80.4194 15.5616 31.2086 28.3456 11.9525 95.0867 16.0692 14.4670 2.4784 9.4100 21.7746 29.6282 0.5406 1.2690 31.5590
temp: 298.150 k
press: 1.00000 atm
elementType: 8 7 7 7 7 7 6 6 6 6 6 6 6 6 6 6 6 6 1 1 1 1 1 1 1 1 1 1 1 1 1 1 1 1 1 1 1
symmnumber: 1
zpe: 799604.0 jmol-1
zpe.correction: 0.304553 hartree
zpe.thermalcorrener: 0.323276 hartree
zpe.thermalcorrenthalpy: 0.324220 hartree
zpe.thermalcorrgfe: 0.257492 hartree
zpe.sumelectzpe: -816.214243 hartree
zpe.sumelectthermal: -816.195520 hartree
zpe.sumelectthermalent: -816.194575 hartree
zpe.sumelectthermalfe: -816.261304 hartree
dipole: 1.8648 -0.7625 -2.1778
dipole: 2.9668
quadrupole: -87.3858 -101.2788 -114.6881
quadrupole: -1.5100 -1.9775 0.4662
quadrupole: 13.7318 -0.1613 -13.5706 -1.5100 -1.9775 0.4662
hfenergy: -816.5187959 hartree
pointgroup: C01 [X(C12H19N5O1)]
dipole: 0.8181495 0.6058722 0.5709267 debye
polarizability: 275.2368853|-12.0573431|163.6192607|9.6299408|-26.4730189|126.4379012 unknown
InChI: InChI=1S/C12H19N5O/c1-9(2)8-17(3)16-15-11-7-5-4-6-10(11)12(18)14-13/h4-7,9,14H,8,13H2,1-3H3
charge 0 multiplicity 1
37 atoms
O  -0.647712 -2.235487 0.070979
N  1.976419 0.892417 0.396895
N  0.667042 0.537108 0.423676
N  -0.123261 1.373644 -0.221079
N  -1.2384 -1.515519 2.198364
N  -0.497791 -2.524409 2.874526
C  3.628314 -1.022423 -0.05291
C  2.90797 -0.093916 0.97444
C  4.768861 -0.309447 -0.819191
C  2.629446 -1.694278 -1.022198
C  2.429117 2.12433 -0.272088
C  -1.501808 1.000008 -0.194063
C  -2.056849 -0.224526 0.304651
C  -2.379074 1.97768 -0.739701
C  -3.460082 -0.41173 0.259844
C  -3.771097 1.771559 -0.783503
C  -4.321219 0.571406 -0.276825
C  -1.228295 -1.3859 0.812416
H  4.095526 -1.814659 0.571963
H  2.297412 -0.714612 1.653729
H  3.661188 0.446898 1.580972
H  5.334987 -1.038291 -1.427634
H  5.482536 0.180547 -0.129039
H  4.374467 0.457045 -1.511014
H  2.20255 -0.953773 -1.724302
H  1.778145 -2.162049 -0.496835
H  3.141426 -2.469168 -1.62226
H  1.822304 2.97798 0.078192
H  2.294878 2.059991 -1.368724
H  3.491328 2.283841 -0.032808
H  -1.929218 2.900203 -1.120933
H  -3.878815 -1.352371 0.636447
H  -4.42342 2.541862 -1.209264
H  -5.401982 0.397464 -0.304951
H  -1.619365 -0.773135 2.787335
H  -0.937327 -3.444649 2.727107
H  0.4707 -2.541939 2.519082
