program: Gaussian 09
title: 000266218
version: EM64L-G09RevD.01
frameworkgroup: C1[X(C15H21N3O2)]
method: RPBEPBE
basis: SDD
operation: Freq
keyword: #p
keyword: freq=noraman
keyword: PBEPBE/SDD
title: #p freq=noraman PBEPBE/SDD
converged: NO YES NO NO
title: Mulliken charges:
elementType: O O N N N C C C C C C C C C C C C C C C H H H H H H H H H H H H H H H H H H H H H
charge: -0.285596 -0.252031 -0.104956 -0.025697 -0.173222 0.025769 -0.428723 -0.445361 -0.389364 -0.399382 -0.391301 -0.629611 0.114221 0.176747 -0.368165 -0.327163 -0.210250 -0.248773 0.169882 -0.501971 0.261595 0.185186 0.233363 0.225548 0.192216 0.203463 0.201667 0.202401 0.203248 0.203018 0.188740 0.225219 0.243084 0.257731 0.244729 0.261896 0.227991 0.229368 0.238318 0.229372 0.236793
chargesum: 0.00000
title: Mulliken charges with hydrogens summed into heavy atoms:
elementType: O O N N N C C C C C C C C C C C C C C C
charge: -0.285596 -0.252031 -0.104956 -0.025697 -0.173222 0.287364 -0.010174 -0.027596 0.015767 0.006266 0.000457 0.096424 0.114221 0.176747 -0.123437 -0.065267 0.017741 -0.019406 0.169882 0.202512
polarizability: 2.82553995e+02 -2.78077855e+01 2.18134669e+02 -8.95143047e+00 3.57868701e+00 1.24677442e+02
1716.lowfreq: -34.7098 -10.5686 -7.6828 -0.0005 -0.0003 0.0002 10.0105 18.7026 39.8582
frequency: -25.9068 17.0621 39.8193 50.2539 77.2087 92.3235 94.0753 116.0997 120.7591 134.3471 153.1602 176.5409 206.6916 220.5418 263.1992 278.2423 298.1807 304.9778 310.1874 336.3237 383.0509 402.1880 420.9507 434.8449 466.3388 475.4156 493.1307 521.3114 553.2178 593.9181 638.3993 662.0421 685.0369 756.8001 761.8863 773.3768 774.8244 788.6935 828.4840 848.0723 870.9648 882.5425 893.9564 910.6169 919.0430 922.4011 962.7533 987.4759 998.3053 1030.5751 1037.5354 1042.7023 1044.5305 1058.3861 1075.1717 1107.8092 1111.4886 1115.4026 1117.0189 1138.5539 1143.4553 1169.2823 1178.2903 1192.3963 1221.2773 1236.3869 1253.6837 1259.9913 1262.4972 1263.8792 1285.6553 1307.2929 1329.8069 1331.9555 1335.3016 1340.0255 1347.3505 1352.5155 1380.5704 1386.5003 1418.8801 1427.4014 1428.2548 1449.4718 1458.8019 1461.0982 1462.2362 1464.9966 1465.3600 1467.9838 1472.4051 1479.1209 1486.3515 1560.7556 1599.8004 1618.7076 2967.5399 2967.7704 2969.6194 2973.9829 2975.3984 2976.1479 2998.2227 3004.5574 3031.7135 3033.2862 3040.2084 3046.5619 3054.5404 3055.1204 3096.7386 3121.9679 3130.9479 3141.4019 3148.4047 3162.4634 3174.6139
redmass: 4.3947 3.0803 4.6799 4.3666 2.4380 1.9916 2.0432 2.7897 3.5103 1.6354 2.7909 2.3168 4.4327 1.8384 3.1093 5.5038 5.2643 3.7578 4.5383 2.3772 3.5123 3.7328 3.3739 3.9140 5.8074 4.8739 1.7941 3.5984 4.5190 3.5705 6.2227 6.2883 4.9053 5.3834 2.5642 2.9333 1.5808 1.4367 3.5188 2.6884 1.7880 1.6273 1.6601 2.4071 2.4074 4.1690 1.3925 1.3252 2.3955 2.4866 5.0667 1.9035 2.0703 1.1465 1.3789 2.4102 1.2820 1.3967 1.7321 2.3964 1.4701 1.0904 2.5950 1.6003 3.4777 1.7460 1.2788 1.4531 2.3209 1.4970 1.8250 1.3278 1.7870 1.3842 1.4473 1.4637 1.4849 4.3135 1.6561 6.0774 1.2421 1.5843 1.5476 1.0511 1.0864 1.2466 1.8287 1.1000 1.0883 1.0714 1.0760 1.0911 1.0822 6.5635 6.8677 9.2784 1.0620 1.0599 1.0644 1.0614 1.0614 1.0425 1.0296 1.0812 1.0955 1.0985 1.1010 1.1015 1.0995 1.1012 1.1040 1.0980 1.0856 1.1043 1.0901 1.0952 1.0988
irintensity: 0.2206 0.0566 1.2606 0.6503 2.3728 2.6197 0.1948 0.6760 2.0216 0.8781 2.3801 0.9209 3.3639 0.5207 0.4790 7.3313 6.1950 2.9663 7.2513 1.8725 3.3339 1.0789 0.8941 3.2128 3.9258 3.6547 1.3194 3.6234 4.0756 4.3114 3.3078 3.0124 29.0557 11.9044 35.0772 8.8000 45.1494 1.1350 13.4694 2.2950 3.7139 1.8296 15.3411 0.1608 1.0002 4.7225 3.1132 0.8890 38.8141 110.9649 257.1110 3.6909 61.7115 0.6325 1.7684 0.5942 0.2389 3.7301 12.9847 21.7399 49.2961 6.0925 7.5926 0.5716 217.8387 26.5119 3.5040 6.6927 8.9827 14.2927 7.8485 1.0016 77.4968 0.3041 0.2242 4.9113 12.1857 273.9748 48.4099 105.3190 21.4994 55.0531 12.8823 11.8900 11.5636 19.4644 81.3566 3.9236 10.9195 4.5108 22.1763 4.8334 21.8645 25.1043 17.3654 175.0232 34.4269 10.2748 18.5767 25.8457 33.8375 104.6808 44.7286 23.0194 71.5306 64.3735 12.8971 44.9688 29.2208 60.6290 28.4805 9.8619 4.1019 19.8877 13.3666 17.6863 22.0787
temp: 298.150 k
press: 1.00000 atm
elementType: 8 8 7 7 7 6 6 6 6 6 6 6 6 6 6 6 6 6 6 6 1 1 1 1 1 1 1 1 1 1 1 1 1 1 1 1 1 1 1 1 1
symmnumber: 1
zpe: 892116.1 jmol-1
zpe.correction: 0.339789 hartree
zpe.thermalcorrener: 0.358942 hartree
zpe.thermalcorrenthalpy: 0.359886 hartree
zpe.thermalcorrgfe: 0.291125 hartree
zpe.sumelectzpe: -897.335961 hartree
zpe.sumelectthermal: -897.316808 hartree
zpe.sumelectthermalent: -897.315864 hartree
zpe.sumelectthermalfe: -897.384626 hartree
dipole: -2.0713 1.2234 1.1588
dipole: 2.6702
quadrupole: -102.6291 -104.7207 -121.2941
quadrupole: 0.1591 -3.8914 3.0092
quadrupole: 6.9189 4.8272 -11.7461 0.1591 -3.8914 3.0092
hfenergy: -897.6757503 hartree
pointgroup: C01 [X(C15H21N3O2)]
dipole: 0.8201163 0.4094569 -0.5131701 debye
polarizability: 282.4983697|26.9038647|215.0843363|-10.5355229|-17.7700053|127.7833999 unknown
InChI: InChI=1S/C15H21N3O2/c1-18(12-8-4-3-5-9-12)17-16-14-11-7-6-10-13(14)15(19)20-2/h6-7,10-12H,3-5,8-9H2,1-2H3
charge 0 multiplicity 1
41 atoms
O  -3.288409 1.900298 -0.477105
O  -1.27566 1.823402 0.686285
N  1.448208 0.555789 -1.0515
N  0.184791 0.066259 -0.992628
N  -0.001108 -0.882435 -0.092132
C  2.523254 0.142909 -0.107602
C  3.352487 -1.043654 -0.671448
C  3.429224 1.33078 0.287651
C  4.418049 -1.492225 0.358124
C  4.48425 0.871022 1.324127
C  5.323849 -0.313433 0.786867
C  1.695663 1.480573 -2.162071
C  -1.370019 -1.213622 0.084934
C  -2.448782 -0.265487 0.086984
C  -1.659767 -2.589381 0.294252
C  -3.782497 -0.742651 0.207003
C  -2.985638 -3.038813 0.431479
C  -4.05794 -2.114123 0.369823
C  -2.219301 1.21013 0.128797
C  -3.208523 3.374598 -0.391181
H  1.986627 -0.218935 0.791292
H  3.854383 -0.731936 -1.610989
H  2.672292 -1.87993 -0.915438
H  2.811029 2.149784 0.701856
H  3.956705 1.726253 -0.604387
H  3.905092 -1.90256 1.251963
H  5.027737 -2.313128 -0.065868
H  5.142704 1.72103 1.587268
H  3.970254 0.562454 2.257238
H  6.045663 -0.647842 1.556734
H  5.919541 0.027161 -0.08562
H  2.485303 1.096228 -2.835658
H  1.999846 2.476145 -1.793805
H  0.755588 1.577718 -2.725227
H  -0.818297 -3.289448 0.316367
H  -4.597229 -0.012969 0.192057
H  -3.186416 -4.106135 0.577304
H  -5.093105 -2.45732 0.468097
H  -3.221353 3.702266 0.662654
H  -4.096269 3.735936 -0.929788
H  -2.280624 3.737393 -0.865409
