program: Gaussian 09
title: 000266217
version: EM64L-G09RevD.01
frameworkgroup: C1[X(C14H21N5O)]
method: RPBEPBE
basis: SDD
operation: Freq
keyword: #p
keyword: freq=noraman
keyword: PBEPBE/SDD
title: #p freq=noraman PBEPBE/SDD
converged: YES YES NO NO
title: Mulliken charges:
elementType: O N N N N N C C C C C C C C C C C C C C H H H H H H H H H H H H H H H H H H H H H
charge: -0.321602 -0.068390 -0.134002 -0.140347 -0.390259 -0.531635 0.002924 -0.420620 -0.440860 -0.390238 -0.397123 -0.391868 -0.635714 0.105161 0.154630 -0.355196 -0.332499 -0.218837 -0.245208 0.132885 0.256026 0.187237 0.237002 0.213420 0.198415 0.207006 0.202700 0.200489 0.205130 0.205606 0.191332 0.234840 0.241709 0.261198 0.242245 0.279855 0.229332 0.231875 0.388513 0.311794 0.293073
chargesum: 0.00000
title: Mulliken charges with hydrogens summed into heavy atoms:
elementType: O N N N N N C C C C C C C C C C C C C C
charge: -0.321602 -0.068390 -0.134002 -0.140347 -0.001746 0.073232 0.258950 0.003620 -0.029024 0.019467 0.008496 0.005070 0.102032 0.105161 0.154630 -0.112951 -0.052644 0.010494 -0.013333 0.132885
polarizability: 2.85267194e+02 -3.30342183e+01 2.34370484e+02 1.60230865e+01 3.64281171e+00 1.24330314e+02
1716.lowfreq: -11.5627 -3.5174 -0.0004 0.0004 0.0005 6.6458 16.3905 30.1546 52.3454
frequency: 14.9362 29.5286 52.3190 58.7038 79.1342 100.6390 117.3314 132.3026 154.7511 172.0147 181.4334 187.9297 223.6485 232.0534 267.9864 283.9091 294.8006 306.2210 332.3656 340.2676 383.4219 400.1321 419.1667 430.3164 459.5367 484.8926 497.3719 532.5964 537.6906 597.7649 637.4080 666.4339 680.6881 761.7519 769.7279 779.6767 783.5579 812.5794 833.8428 850.7528 862.5633 875.5566 891.0529 894.3313 909.3435 923.3936 949.3390 972.7903 994.7445 996.5340 1038.1960 1045.1286 1052.7342 1058.8409 1074.3001 1076.6826 1105.9097 1108.8583 1113.0393 1137.6873 1159.0913 1168.2876 1179.4345 1191.7300 1221.7760 1255.6969 1258.3428 1260.2867 1262.8417 1271.7565 1283.1669 1308.3968 1309.4044 1331.0136 1334.6103 1338.0106 1340.9007 1347.4497 1351.3272 1376.7711 1392.4219 1416.7482 1442.1659 1455.0456 1456.4440 1460.7352 1462.1436 1466.3374 1470.0844 1478.3475 1489.7393 1533.0450 1561.4416 1601.2512 1609.4152 1678.7911 2968.7355 2970.3628 2971.9034 2973.8100 2974.7650 2978.8545 3006.6615 3033.2910 3034.2095 3039.9950 3046.8452 3056.1478 3057.3137 3057.6998 3114.6567 3132.3693 3146.7524 3159.5389 3170.8623 3352.0966 3465.9100
redmass: 4.0532 3.7077 4.5737 4.4779 4.6318 3.8691 2.9581 2.3426 2.1970 2.2039 1.2862 3.1701 2.0158 3.2568 3.1056 3.7276 4.2790 4.6800 2.8146 3.3838 4.5068 3.5514 3.5118 3.8814 4.4526 2.1858 3.0332 4.3568 3.7654 3.9694 6.1679 6.0557 4.5028 3.2324 2.6460 1.4500 1.4425 3.4017 2.8830 2.1475 2.1270 2.2449 1.5184 1.5478 2.2104 2.3122 1.3839 1.3689 1.3418 2.3899 2.7380 1.7771 1.9298 1.1808 3.0648 1.3689 1.9969 2.1397 1.4393 2.5453 2.8970 1.1166 2.3307 1.5846 1.8711 1.5689 1.5233 1.4248 1.4273 2.0361 2.0659 1.6723 1.4258 1.5221 1.3873 1.5099 1.4678 1.4953 5.1464 1.6463 5.8070 2.2411 1.2268 1.1490 2.2779 1.0751 1.0877 1.0741 1.0783 1.0886 1.0654 5.7210 5.0062 1.8954 2.8487 1.0788 1.0641 1.0650 1.0566 1.0620 1.0614 1.0421 1.0821 1.0973 1.0962 1.1019 1.1013 1.1000 1.1000 1.0958 1.0990 1.0853 1.0895 1.0940 1.1007 1.0430 1.0966
irintensity: 0.7243 0.4435 0.2126 0.5741 4.1684 2.5050 3.4758 0.2300 0.2996 0.6662 57.4041 3.0090 0.8090 6.3070 1.0136 2.8258 3.4201 3.6570 20.9315 18.5583 5.0497 4.3278 3.9551 0.4358 7.6974 0.6092 0.8766 7.5920 0.8641 5.1110 4.9463 5.7324 23.2467 13.8002 6.5975 59.7990 0.1295 41.7145 33.5062 51.5509 92.4561 7.7833 2.0548 10.3783 2.7729 5.0019 133.1567 3.4143 1.3112 42.7539 31.9147 1.9410 141.1593 2.8725 20.0932 1.4234 3.1057 1.8900 0.3830 19.8713 2.4313 2.0131 7.3076 1.3594 18.7413 5.7167 9.3832 7.2181 0.9538 25.8944 29.5516 19.0535 4.7234 4.4320 1.0932 15.0552 1.0558 5.1835 60.1126 66.3440 221.2914 10.6184 37.1149 8.8571 17.7330 11.6029 13.6361 11.6409 14.4607 6.3023 18.5936 116.0321 58.9339 93.7202 52.0835 2.4568 37.0518 16.6670 15.2844 19.8697 24.7444 99.6915 25.3270 81.6765 66.7106 2.4135 57.5645 55.0284 71.6962 481.8432 4.2395 2.1333 10.3092 8.8398 33.2161 6.4160 5.3105
temp: 298.150 k
press: 1.00000 atm
elementType: 8 7 7 7 7 7 6 6 6 6 6 6 6 6 6 6 6 6 6 6 1 1 1 1 1 1 1 1 1 1 1 1 1 1 1 1 1 1 1 1 1
symmnumber: 1
zpe: 898394.6 jmol-1
zpe.correction: 0.342180 hartree
zpe.thermalcorrener: 0.361806 hartree
zpe.thermalcorrenthalpy: 0.362750 hartree
zpe.thermalcorrgfe: 0.292732 hartree
zpe.sumelectzpe: -893.493923 hartree
zpe.sumelectthermal: -893.474298 hartree
zpe.sumelectthermalent: -893.473353 hartree
zpe.sumelectthermalfe: -893.543371 hartree
dipole: -5.8625 -0.0126 -1.9760
dipole: 6.1866
quadrupole: -119.4609 -107.9949 -122.8823
quadrupole: -6.9095 -5.7231 -3.7275
quadrupole: -2.6815 8.7845 -6.1030 -6.9095 -5.7231 -3.7275
hfenergy: -893.8361034 hartree
pointgroup: C01 [X(C14H21N5O1)]
dipole: 2.2011044 1.0045359 -0.2652022 debye
polarizability: 288.9963949|12.1462788|160.6753504|-37.9459625|45.96786|194.2962469 unknown
InChI: InChI=1S/C14H21N5O/c1-19(11-7-3-2-4-8-11)18-17-13-10-6-5-9-12(13)14(20)16-15/h5-6,9-11,16H,2-4,7-8,15H2,1H3
charge 0 multiplicity 1
41 atoms
O  -3.656565 -2.472276 -1.041763
N  1.432221 0.075627 -1.259318
N  0.084373 0.033982 -1.047947
N  -0.3113 0.427934 0.139348
N  -1.869049 -1.438857 -2.086742
N  -1.759553 -2.500191 -3.037435
C  2.385802 0.437151 -0.173751
C  2.73314 -0.803455 0.695145
C  3.660356 1.120175 -0.718544
C  3.669115 -0.40263 1.859961
C  4.585828 1.523332 0.457618
C  4.943798 0.304954 1.342399
C  1.886574 -0.505037 -2.529259
C  -1.709053 0.405288 0.45674
C  -2.78918 -0.434638 -0.011975
C  -1.978694 1.328943 1.514306
C  -4.059417 -0.29264 0.618123
C  -3.252052 1.472198 2.085434
C  -4.308578 0.645982 1.634188
C  -2.793158 -1.524979 -1.066205
H  1.837646 1.153512 0.468249
H  3.233699 -1.566063 0.063393
H  1.801051 -1.250547 1.085722
H  3.386657 2.01121 -1.315984
H  4.213565 0.428945 -1.386028
H  3.93761 -1.299709 2.449629
H  3.123486 0.278359 2.544701
H  4.076733 2.289314 1.077659
H  5.505547 1.993389 0.059931
H  5.575206 0.626444 2.192619
H  5.546251 -0.413228 0.74822
H  2.544768 -1.376619 -2.351576
H  2.43818 0.236907 -3.133054
H  1.007423 -0.84858 -3.095777
H  -1.132865 1.926214 1.869681
H  -4.846324 -0.974566 0.280155
H  -3.415107 2.203954 2.88409
H  -5.307017 0.722613 2.077366
H  -1.037303 -0.814302 -1.966849
H  -2.223362 -3.332433 -2.633367
H  -2.236152 -2.235177 -3.913704
