program: Gaussian 09
title: 000266216
version: EM64L-G09RevD.01
frameworkgroup: C1[X(C13H19N3O2)]
method: RPBEPBE
basis: SDD
operation: Freq
keyword: #p
keyword: freq=noraman
keyword: PBEPBE/SDD
title: #p freq=noraman PBEPBE/SDD
converged: YES YES NO NO
title: Mulliken charges:
elementType: O O N N N C C C C C C C C C C C C C H H H H H H H H H H H H H H H H H H H
charge: -0.282323 -0.253835 -0.082577 -0.008282 -0.179846 -0.015751 -0.360697 -0.716236 -0.695932 -0.615159 0.108040 0.182789 -0.367716 -0.325035 -0.209663 -0.249732 0.174110 -0.501785 0.268141 0.200969 0.188186 0.222478 0.209841 0.233336 0.265952 0.203681 0.215391 0.231023 0.257978 0.233615 0.245754 0.259661 0.228395 0.229895 0.239216 0.235669 0.230447
chargesum: 0.00000
title: Mulliken charges with hydrogens summed into heavy atoms:
elementType: O O N N N C C C C C C C C C C C C C
charge: -0.282323 -0.253835 -0.082577 -0.008282 -0.179846 0.252390 0.028458 -0.050580 -0.010908 0.107457 0.108040 0.182789 -0.121961 -0.065374 0.018731 -0.019837 0.174110 0.203548
polarizability: 2.65146162e+02 -2.16453658e+01 1.90927534e+02 7.64592835e+00 -5.65625658e+00 1.12408536e+02
1716.lowfreq: -5.8740 -3.2621 -1.4750 -0.0003 -0.0002 0.0001 26.1372 39.1650 48.0142
frequency: 25.6690 39.0650 47.9776 68.6688 86.9011 96.1877 100.1387 113.6199 116.2381 132.8282 159.5186 185.8732 205.1582 216.2615 241.9273 250.0593 268.9660 292.7777 306.4797 324.7461 342.5722 391.8837 405.5466 416.2002 478.5042 499.8775 526.7392 554.5588 557.6946 638.0962 659.6863 684.5562 716.0242 758.9060 767.2450 773.6273 800.1542 845.8204 871.7507 884.6274 920.3703 961.7786 964.7685 987.2676 997.2137 1029.0468 1034.0759 1037.9175 1041.6626 1078.6341 1110.0056 1112.3081 1117.7964 1120.5639 1143.7470 1164.4421 1169.5999 1186.2471 1221.8967 1239.5265 1260.8488 1270.7969 1290.6897 1303.7390 1342.0569 1354.6084 1380.7917 1386.9951 1388.2084 1403.8858 1418.6379 1427.6810 1429.6174 1449.7610 1459.7437 1462.3279 1464.7749 1472.8730 1476.3488 1480.4067 1481.4376 1488.2631 1493.9921 1560.9166 1599.6555 1617.1969 2969.3431 2978.3592 2982.5713 2984.8230 2998.5998 3014.8005 3032.8872 3054.6361 3075.7361 3078.0618 3087.9971 3088.8271 3097.2496 3123.6935 3131.7003 3142.1075 3148.7527 3162.7712 3174.2564
redmass: 3.3399 4.3557 3.9923 3.8669 2.7377 2.0189 1.6492 2.8094 1.3753 3.4656 4.1518 1.4027 3.2178 1.1402 1.4202 2.8085 5.3736 3.5824 3.5937 4.5435 3.9939 5.1029 3.8010 4.2634 4.6902 3.6006 3.6743 5.0825 3.4123 6.1403 5.2404 4.9953 2.9012 4.7834 3.2961 1.5638 1.3017 2.5667 2.3314 1.9543 7.1336 1.3916 1.2885 1.3257 1.3576 2.3923 3.1331 3.9226 2.3841 1.8707 1.2786 2.0618 1.7500 1.4933 1.4630 2.2044 1.0753 3.0510 3.6088 1.8215 1.9363 1.7991 1.9160 1.2983 1.4370 6.0506 1.7813 1.6059 2.6839 1.2095 1.2406 2.0903 1.2848 1.0512 1.0872 2.1419 1.1240 1.0498 1.0487 1.0487 1.0595 1.0786 1.0584 6.5217 6.9851 8.9843 1.0591 1.0364 1.0364 1.0375 1.0296 1.0925 1.0908 1.1013 1.0988 1.0993 1.1002 1.0999 1.1040 1.0978 1.0856 1.1043 1.0900 1.0949 1.0993
irintensity: 0.2550 0.9601 0.4706 2.6050 1.3428 2.5175 0.4892 0.9434 0.5805 0.8340 3.3898 0.5876 2.5635 0.1482 1.5910 2.6684 2.9232 9.0197 8.6993 0.9542 2.8648 6.5593 1.3141 2.9955 5.2037 3.6886 4.9760 3.4985 4.7560 2.6949 5.7709 28.7515 3.6757 24.9214 30.4216 45.4419 9.9513 7.8371 0.6664 1.2442 5.0039 3.6939 6.4754 0.7474 36.0590 92.0020 20.9927 180.2725 49.0323 115.4947 0.1456 4.9715 12.3263 1.5314 48.1559 5.7659 5.0589 14.4647 213.5535 5.0252 28.2854 22.1009 0.8297 16.1496 5.5919 241.7671 77.2482 64.8144 88.1451 16.9573 22.3057 35.3902 42.7611 11.4780 12.4386 87.0029 4.9929 13.2551 9.7732 7.0009 7.7226 35.0995 10.5963 22.5951 25.3669 187.0982 29.7513 19.2267 124.5588 25.1890 43.2925 14.8127 18.1225 30.9164 18.8865 55.5548 10.8238 47.4632 28.2527 8.3237 4.0921 19.5375 12.2856 16.9528 22.9445
temp: 298.150 k
press: 1.00000 atm
elementType: 8 8 7 7 7 6 6 6 6 6 6 6 6 6 6 6 6 6 1 1 1 1 1 1 1 1 1 1 1 1 1 1 1 1 1 1 1
symmnumber: 1
zpe: 795429.5 jmol-1
zpe.correction: 0.302963 hartree
zpe.thermalcorrener: 0.322573 hartree
zpe.thermalcorrenthalpy: 0.323517 hartree
zpe.thermalcorrgfe: 0.254009 hartree
zpe.sumelectzpe: -820.061965 hartree
zpe.sumelectthermal: -820.042356 hartree
zpe.sumelectthermalent: -820.041411 hartree
zpe.sumelectthermalfe: -820.110919 hartree
dipole: -1.8799 0.8998 -1.2425
dipole: 2.4264
quadrupole: -89.9132 -93.9182 -110.9740
quadrupole: 0.6793 4.1507 -3.6676
quadrupole: 8.3553 4.3502 -12.7055 0.6793 4.1507 -3.6676
hfenergy: -820.3649285 hartree
pointgroup: C01 [X(C13H19N3O2)]
dipole: -0.7572474 -0.1657954 0.5571086 debye
polarizability: 266.8700002|15.8802146|179.5262978|-11.8087878|-26.1908268|122.0859343 unknown
InChI: InChI=1S/C13H19N3O2/c1-5-10(2)16(3)15-14-12-9-7-6-8-11(12)13(17)18-4/h6-10H,5H2,1-4H3
charge 0 multiplicity 1
37 atoms
O  2.118759 -2.076742 1.211744
O  0.321711 -1.953801 -0.257954
N  -2.258782 0.229414 0.787289
N  -0.908977 0.374275 0.76442
N  -0.434411 1.102014 -0.226335
C  -3.180601 0.76297 -0.2620
C  -3.856078 -0.390602 -1.052181
C  -4.211825 1.732237 0.358375
C  -2.854528 -1.291093 -1.805738
C  -2.767509 -0.54953 1.92063
C  0.983236 1.09615 -0.294806
C  1.828367 -0.017653 0.036706
C  1.581278 2.301944 -0.753019
C  3.238626 0.15079 -0.019838
C  2.979183 2.439894 -0.824142
C  3.81747 1.364565 -0.439001
C  1.299083 -1.390757 0.294413
C  1.742713 -3.486131 1.45729
H  -2.518033 1.322632 -0.947197
H  -4.55939 0.075191 -1.770993
H  -4.480631 -0.997552 -0.364614
H  -4.795724 2.213927 -0.446413
H  -4.92608 1.207529 1.02006
H  -3.711216 2.52577 0.940807
H  -2.097762 -1.726633 -1.129569
H  -3.379719 -2.118726 -2.316882
H  -2.304553 -0.713325 -2.570993
H  -3.454484 0.050165 2.545713
H  -1.902245 -0.857076 2.526113
H  -3.302634 -1.452053 1.572657
H  0.915008 3.12718 -1.024302
H  3.873555 -0.697772 0.251205
H  3.416292 3.383099 -1.170445
H  4.90681 1.465712 -0.483516
H  1.799898 -4.070952 0.523198
H  0.714237 -3.545458 1.852623
H  2.472256 -3.846204 2.1967
